{"text_format":"1","workbook":"xlsx","n_sheets":14,"sheets":["Intro","Inputs","Final Summary","Map Help","PB Liquefaction Initiation","Det Liquefaction Initiation","PB Settlement","Det Settlement","Lateral Spread","Slope Displacement","References","Version Notes","_Hidden","_HiddenCopy"],"not_rendered":{"charts":11,"images":31,"macros":1,"external_links":0,"defined_names":87,"comments":3,"pivot_tables":0},"unopened":[],"bounds":{"document_bytes":16777216,"sheet_cells":100000,"rows_first":2000,"rows_last":500,"rows_between":2000,"halvings":0,"cell_chars":16384,"cell_head_chars":4096},"cells_cut":0,"cells_raw":0,"read":"whole","date_system":"1900"}

{"sheet":"Intro","index":0,"n_rows":33,"n_cols":5,"rows_kept":33,"cut":false,"hidden":false,"merged":[[5,1,7,7],[21,2,23,6],[32,1,34,7],[1,1,3,7]]}
[]
[null,"Simplified Performance-based Liquefaction Analysis Tool                            \"SPLiq\""]
[]
[]
[]
[null,"A Simplified, Performance-based Tool for Estimating Liquefaction Hazard, Settlement, Lateral Spread, and Seismic Slope Stability"]
{"$rows_left_out":28}
{"sheet":"Inputs","index":1,"n_rows":67,"n_cols":29,"rows_kept":67,"cut":false,"hidden":false,"merged":[[2,2,2,3],[3,2,3,3],[12,22,13,23],[1,2,1,5],[1,7,1,10],[2,7,2,10],[3,7,3,10],[23,10,24,12],[58,5,58,6],[58,9,58,10],[47,1,47,2],[47,5,47,6],[47,9,47,10],[58,1,58,4]]}
[]
[null,"Company:","GEO Company",null,null,null,"Project Name:","Example Problem"]
[null,"Designer:","BME",null,"Checked By:",null,"Location:","Salt Lake City, UT"]
[null,"Date:","2018-09-05",null,"Date:",null,"Project #:","AB-123-4567",null,null,null,null,null,"= General",null,null,"= Liquefaction-specific",null,null,"= Lateral Spread-specific"]
[null,null,null,null,null,null,null,null,null,null,null,null,null,null,null,null,"=Settlement-specific",null,null,"=Slope Displacement-specific"]
[null,"Units:",2,null,"(1 = SI, 2 = US Customary)",null,"Latitude =",40.674579999999999,"Longitude=",-111.91495,null,null,null,null,"Analysis Selections:",null,null,"*Select \"TRUE\" to run analysis"]
{"$rows_left_out":62}
{"sheet":"Final Summary","index":2,"n_rows":46,"n_cols":40,"rows_kept":46,"cut":false,"hidden":false,"merged":[[39,38,40,38],[39,32,40,32],[39,33,40,33],[39,34,40,34],[39,36,40,36],[39,37,40,37],[25,37,25,39],[35,31,36,33],[35,35,36,37],[37,32,38,32],[37,33,38,33],[37,34,38,34],[37,36,38,36],[37,37,38,37],[37,38,38,38],[0,13,0,14],[1,13,1,14],[2,13,2,14],[0,15,0,19],[1,15,1,19],[2,15,2,19],[0,10,0,12],[0,1,0,3],[0,5,0,8],[1,5,1,8],[2,5,2,8],[0,36,0,39],[1,36,1,39],[2,36,2,39],[0,21,0,23],[0,24,0,25],[0,26,0,30],[1,24,1,25],[1,26,1,30],[2,24,2,25],[2,26,2,30],[0,32,0,34],[41,4,41,6],[18,38,19,38],[16,31,17,33],[16,35,17,37],[6,34,6,36],[23,21,23,25],[23,26,23,30],[6,37,6,39],[18,33,19,33],[18,37,19,37],[18,32,19,32],[18,34,19,34],[18,36,19,36],[23,10,23,14],[23,15,23,19],[25,34,25,35]]}
["Company:",{"$f":"IF(Inputs!$C$2=\"\",\"\",Inputs!$C$2)","v":"GEO Company"},null,null,"Project:",{"$f":"IF(Inputs!$H$2=\"\",\"\",Inputs!$H$2)","v":"Example Problem"},null,null,null,"Company:",{"$f":"IF(Inputs!$C$2=\"\",\"\",Inputs!$C$2)","v":"GEO Company"},null,null,"Project:",null,{"$f":"IF(Inputs!$H$2=\"\",\"\",Inputs!$H$2)","v":"Example Problem"},null,null,null,null,"Company:",{"$f":"IF(Inputs!$C$2=\"\",\"\",Inputs!$C$2)","v":"GEO Company"},null,null,"Project:",null,{"$f":"IF(Inputs!$H$2=\"\",\"\",Inputs!$H$2)","v":"Example Problem"},null,null,null,null,"Company:",{"$f":"IF(Inputs!$C$2=\"\",\"\",Inputs!$C$2)","v":"GEO Company"},null,null,"Project:",{"$f":"IF(Inputs!$H$2=\"\",\"\",Inputs!$H$2)","v":"Example Problem"}]
["Designer:",{"$f":"IF(Inputs!$C$3=\"\",\"\",Inputs!$C$3)","v":"BME"},"Checked by:",{"$f":"IF(Inputs!$F$3=\"\",\"\",Inputs!$F$3)","v":""},"Location:",{"$f":"IF(Inputs!$H$3=\"\",\"\",Inputs!$H$3)","v":"Salt Lake City, UT"},{"$f":"IF(Inputs!I3=\"\",\"\",Inputs!I3)","v":""},{"$f":"IF(Inputs!J3=\"\",\"\",Inputs!J3)","v":""},{"$f":"IF(Inputs!K3=\"\",\"\",Inputs!K3)","v":""},"Designer:",{"$f":"IF(Inputs!$C$3=\"\",\"\",Inputs!$C$3)","v":"BME"},"Checked:",{"$f":"IF(Inputs!$F$3=\"\",\"\",Inputs!$F$3)","v":""},"Location:",null,{"$f":"IF(Inputs!$H$3=\"\",\"\",Inputs!$H$3)","v":"Salt Lake City, UT"},null,null,null,null,"Designer:",{"$f":"IF(Inputs!$C$3=\"\",\"\",Inputs!$C$3)","v":"BME"},"Checked:",{"$f":"IF(Inputs!$F$3=\"\",\"\",Inputs!$F$3)","v":""},"Location:",null,{"$f":"IF(Inputs!$H$3=\"\",\"\",Inputs!$H$3)","v":"Salt Lake City, UT"},null,null,null,null,"Designer:",{"$f":"IF(Inputs!$C$3=\"\",\"\",Inputs!$C$3)","v":"BME"},"Checked:",{"$f":"IF(Inputs!$F$3=\"\",\"\",Inputs!$F$3)","v":""},"Location:",{"$f":"IF(Inputs!$H$3=\"\",\"\",Inputs!$H$3)","v":"Salt Lake City, UT"},{"$f":"IF(Inputs!AN3=\"\",\"\",Inputs!AN3)","v":""},{"$f":"IF(Inputs!AO3=\"\",\"\",Inputs!AO3)","v":""},{"$f":"IF(Inputs!AP3=\"\",\"\",Inputs!AP3)","v":""}]
["Date:",{"$f":"IF(Inputs!$C$4=\"\",\"\",Inputs!$C$4)","v":"2018-09-05"},"Date:",{"$f":"IF(Inputs!$F$4=\"\",\"\",Inputs!$F$4)","v":""},"Project #:",{"$f":"IF(Inputs!$H$4=\"\",\"\",Inputs!$H$4)","v":"AB-123-4567"},{"$f":"IF(Inputs!I4=\"\",\"\",Inputs!I4)","v":""},{"$f":"IF(Inputs!J4=\"\",\"\",Inputs!J4)","v":""},{"$f":"IF(Inputs!K4=\"\",\"\",Inputs!K4)","v":""},"Date:",{"$f":"IF(Inputs!$C$4=\"\",\"\",Inputs!$C$4)","v":"2018-09-05"},"Date:",{"$f":"IF(Inputs!$F$4=\"\",\"\",Inputs!$F$4)","v":""},"Project #:",null,{"$f":"IF(Inputs!$H$4=\"\",\"\",Inputs!$H$4)","v":"AB-123-4567"},null,null,null,null,"Date:",{"$f":"IF(Inputs!$C$4=\"\",\"\",Inputs!$C$4)","v":"2018-09-05"},"Date:",{"$f":"IF(Inputs!$F$4=\"\",\"\",Inputs!$F$4)","v":""},"Project #:",null,{"$f":"IF(Inputs!$H$4=\"\",\"\",Inputs!$H$4)","v":"AB-123-4567"},null,null,null,null,"Date:",{"$f":"IF(Inputs!$C$4=\"\",\"\",Inputs!$C$4)","v":"2018-09-05"},"Date:",{"$f":"IF(Inputs!$F$4=\"\",\"\",Inputs!$F$4)","v":""},"Project #:",{"$f":"IF(Inputs!$H$4=\"\",\"\",Inputs!$H$4)","v":"AB-123-4567"},{"$f":"IF(Inputs!AN4=\"\",\"\",Inputs!AN4)","v":""},{"$f":"IF(Inputs!AO4=\"\",\"\",Inputs!AO4)","v":""},{"$f":"IF(Inputs!AP4=\"\",\"\",Inputs!AP4)","v":""}]
[]
["Summary of Inputs for Liquefaction Initiation:",null,null,null,null,null,null,null,null,"Liquefaction Initiation and Settlement Simplified Performance-based Results:",null,null,null,null,null,null,null,null,null,null,"Liquefaction Initiation and Settlement Deterministic Results:",null,null,null,null,null,null,null,null,null,null,"Summary of Inputs for Lateral Spread Analysis:"]
[null,null,null,null,null,null,"Hammer Efficiency =",{"$f":"IF(Hammer_Eff=\"\",\"\",Hammer_Eff)","v":77},"%"]
{"$rows_left_out":41}
{"sheet":"Map Help","index":3,"n_rows":57,"n_cols":28,"rows_kept":57,"cut":false,"hidden":false,"merged":[[13,11,13,12],[14,11,14,12]]}
[]
[]
[]
[]
[null,null,null,null,null,null,null,null,null,null,null,null,null,null,null,null,null,null,null,null,null,null,null,null,null,{"$f":"IF($A5=\"\",\"\",IF($A5=\"\",\"\",$T5*$U5*$V5*$W5*$X5*$Y5))","v":""}]
[null,null,null,null,null,null,null,null,null,null,null,null,null,null,null,null,null,null,null,null,null,null,null,null,null,{"$f":"IF($A6=\"\",\"\",IF($A6=\"\",\"\",$T6*$U6*$V6*$W6*$X6*$Y6))","v":""}]
{"$rows_left_out":52}
{"sheet":"PB Liquefaction Initiation","index":4,"n_rows":62,"n_cols":44,"rows_kept":62,"cut":false,"hidden":false,"merged":[[0,27,2,27],[1,30,2,30],[7,20,7,21],[7,6,7,7]]}
["Simplified Performance-based Liquefaction Triggering using Boulanger & Idriss (2012)",null,null,null,null,null,null,null,null,null,null,null,null,null,null,null,null,null,null,null,null,null,"Idriss and Boulanger (2008) (N1)60 Corrections",null,null,null,null,"Borehole Diameter [mm]",null,null,null,null,null,"Idriss and Boulanger (2014) Simplified MSF Correction Factors"]
["PGA:",{"$f":"IF(Inputs!$C$36=\"\",NA(),Inputs!$C$36)","v":0.44},"g",null,null,null,null,null,null,null,null,null,null,null,null,null,null,null,null,null,null,null,null,null,null,null,null,null,null,null,"Rod Length [m]"]
["Fpga:",{"$f":"IF(Fpga=\"\",NA(),Fpga)","v":1.06},null,null,null,null,null,null,null,"Hammer Efficiency (%) =",{"$f":"Hammer_Eff","v":77},null,null,null,null,null,null,null,null,null,null,null,"Pa =",101.325,"kPa",null,null,null,"CB",null,null,"CR"]
["Depth to Water:",{"$f":"IF(design_gw=\"\",NA(),IF(units=2,CONVERT(design_gw,\"ft\",\"m\"),design_gw))","v":0},"m",null,null,null,null,null,null,"Borehole Diameter =",{"$f":"IF(units=1,Bore_Diam,CONVERT(Bore_Diam,\"in\",\"m\")*1000)","v":107.95},"mm",null,null,null,null,null,null,null,null,null,null,null,2116.2159999999999,"psf",null,null,"65 - 115 mm",1,null,"< 3",0.75]
["Mw:",{"$f":"IF(Inputs!$C$38=\"\",NA(),Inputs!$C$38)","v":6.77},null,null,null,null,null,null,null,"Rod Stickup Length =",{"$f":"IF(units=1,Rod_stickup,CONVERT(Rod_stickup,\"ft\",\"m\"))","v":1.524},"m",null,null,null,null,null,null,null,null,null,null,null,null,null,null,null,"150 mm",1.05,null,"3 - 4",0.8]
["CSRref:",{"$f":"IF(Inputs!$C$50=\"\",NA(),Inputs!$C$50)","v":35.14},"%",null,null,null,null,null,null,null,null,null,null,null,null,null,null,null,null,null,null,null,null,null,null,null,null,"200 mm",1.1499999999999999,null,"4 - 6",0.85]
{"$rows_left_out":57}
{"sheet":"Det Liquefaction Initiation","index":5,"n_rows":62,"n_cols":21,"rows_kept":62,"cut":false,"hidden":false,"merged":[]}
["Deterministic Liquefaction Triggering using Boulanger & Idriss (2008, 2014)"]
["PGA:",{"$f":"IF(PGA_det=\"\",NA(),PGA_det)","v":0.73},"g","amax =",{"$f":"B2*B3","v":0.73}]
["Fpga:",{"$f":"IF(Fpga_det=\"\",NA(),Fpga_det)","v":1}]
["Depth to Water:",{"$f":"'PB Liquefaction Initiation'!B4","v":0},"m"]
["Mw:",{"$f":"IF(Mw_det=\"\",NA(),Mw_det)","v":6.8}]
[]
{"$rows_left_out":57}
{"sheet":"PB Settlement","index":6,"n_rows":55,"n_cols":35,"rows_kept":55,"cut":false,"hidden":false,"merged":[[5,23,5,24],[33,23,33,24],[5,25,5,29],[33,25,33,29],[5,30,5,34],[33,30,33,34],[5,3,5,11],[5,12,5,20],[5,21,5,22],[33,3,33,7],[33,12,33,16],[33,21,33,22]]}
["Simplified Performance-based Settlement using Ishihara & Yoshimine (1992)"]
[]
["Depth to Water:",{"$f":"IF(design_gw=\"\",NA(),IF(units=2,CONVERT(design_gw,\"ft\",\"m\"),design_gw))","v":0},"m"]
["εv,IYref (%):",{"$f":"IF(Inputs!C53=\"\",NA(),Inputs!C53)","v":2.2999999999999998}]
["CSRref (%):",{"$f":"IF(CSR_ref_BI=\"\",NA(),CSR_ref_BI)","v":35.14}]
[null,null,null,"Compute Approximate Site Strain",null,null,null,null,null,null,null,null,"Compute Approximate Reference Strain",null,null,null,null,null,null,null,null,"Compute Corrrection Factor and Site Strain",null,"Calibrated Strain",null,"Compute Ground Surface Settlment",null,null,null,null,"Compute Settlement for Each Layer"]
{"$rows_left_out":50}
{"sheet":"Det Settlement","index":7,"n_rows":52,"n_cols":21,"rows_kept":52,"cut":false,"hidden":false,"merged":[[30,11,30,15],[30,16,30,20],[30,3,30,6],[4,3,4,10],[4,11,4,15],[4,16,4,20]]}
["Simplified Performance-based Settlement using Ishihara & Yoshimine (1992)"]
[]
["Depth to Water:",{"$f":"IF(design_gw=\"\",NA(),IF(units=2,CONVERT(design_gw,\"ft\",\"m\"),design_gw))","v":0},"m"]
[]
[null,null,null,"Compute Deterministic Vertical Strain",null,null,null,null,null,null,null,"Compute Ground Surface Settlment",null,null,null,null,"Compute Settlement for Each Layer"]
["Depth (m)","Thickness (m)","Susceptible?","(N1)60,Cssite","CRR(Nsite)","CSRsite","FSLsite","Fαsite","γLIMsite","γMAXsite","εvsite","DFi","ε*t*DFi","t*DFi","εv,eqv.site","Ssite (m)","εi*Dfi*Σti","Σ(ti*DFi)","εisite","Si (cm)","Ssite (cm)"]
{"$rows_left_out":47}
{"sheet":"Lateral Spread","index":8,"n_rows":25,"n_cols":17,"rows_kept":25,"cut":false,"hidden":false,"merged":[[23,5,23,6],[22,1,22,3],[22,5,22,7],[2,1,2,4],[2,14,2,16],[11,1,11,2],[12,1,12,2],[14,1,14,4],[16,1,16,2],[15,1,15,2],[17,1,17,2]]}
[null,"Inputs"]
[null,null,null,null,null,null,"Original Model"]
[null,"Simplified Method",null,null,null,null,null,null,null,null,null,null,null,null,"Regression Coefficients"]
[null,"Case:  Free Face / Ground Slope",null,null,null,null,null,null,null,null,null,null,null,null,null,"GS","FF"]
[null,"S =",{"$f":"IF(S_prob=\"\",\"\",S_prob)","v":1.5},"%",null,null,null,null,null,null,null,null,null,null,"b0",-16.213000000000001,-16.713000000000001]
[null,"W =",{"$f":"IF(W_prob=\"\",\"\",W_prob)","v":16},"%",null,null,null,null,null,null,null,null,null,null,"b1",1.532,1.532]
{"$rows_left_out":20}
{"sheet":"Slope Displacement","index":9,"n_rows":60,"n_cols":9,"rows_kept":60,"cut":false,"hidden":false,"merged":[[58,5,58,6],[2,1,2,3],[26,1,26,3],[26,5,26,7],[27,5,27,6],[33,1,33,3],[57,1,57,3],[57,5,57,7]]}
["Simplified Performance-based Seismic Slope Displacement Rathje & Saygili (2009)"]
[]
[null,"Simplified Method"]
[null,"Input site information",null,null,null,null,"Original Model"]
[]
[null,"kysite",{"$f":"IF(ky_site=\"\",\"\",ky_site)","v":0.2}]
{"$rows_left_out":55}
{"sheet":"References","index":10,"n_rows":165,"n_cols":34,"rows_kept":165,"cut":false,"hidden":false,"merged":[[38,2,38,6],[39,1,39,6],[25,1,25,2],[21,3,21,4],[21,1,22,2],[23,1,23,2],[24,1,24,2],[31,1,32,1],[31,2,31,6]]}
["Liquefaction Initiation / Settlement",null,null,null,null,null,null,null,null,null,null,null,null,null,null,null,null,null,null,"Lateral Spread Displacement",null,null,null,null,null,null,null,null,null,null,null,null,null,"Seismic Slope Displacement"]
[]
[null,null,null,null,null,null,null,null,null,null,null,null,null,null,null,null,null,null,null,null,null,null,null,null,null,null,null,null,null,null,null,null,null,"Seismic Slope Displacement Parameters for both Rathje & Saygili (2009) and Bray & Travasarou (2007):"]
["Liquefaction Initiation Parameters (Performance-Based):",null,null,null,null,null,null,null,null,null,null,null,null,null,null,null,null,null,null,"Lateral Spread Parameters (Youd et al 2002 Model):"]
[]
[]
{"$rows_left_out":160}
{"sheet":"Version Notes","index":11,"n_rows":37,"n_cols":3,"rows_kept":37,"cut":false,"hidden":false,"merged":[]}
["Version","Date","Change"]
["BETA1.91",null,"Added a \"Version Notes\" Sheet"]
[null,null,"Changed how C_sigma is calculated on the \"Det Liquefaction Initiation\" Sheet; C_sigma is now calculated from (N1)60cs"]
[]
["BETA1.92",null,"Removed settlement-specific analysis selections on \"Inputs\" sheet. Settlement will now automatically compute and display when Liquefaction Initiation is computed"]
[null,null,"\"Site Liquefaction/Slope Disp. Parameters\" section on \"Inputs\" sheet renamed to \"Ground Motion Parameters\""]
{"$rows_left_out":32}
{"sheet":"_Hidden","index":12,"n_rows":61,"n_cols":35,"rows_kept":61,"cut":false,"hidden":true,"merged":[[3,29,3,34],[3,3,4,3],[3,5,3,10],[3,11,3,16],[3,21,4,21],[3,23,3,28]]}
["Units",null,null,"Simplified PB",null,null,null,null,null,null,null,null,null,null,null,null,null,null,null,null,null,"Deterministic"]
[1,null,null,"(Step-wise Plot)",null,null,null,null,null,null,null,null,null,null,null,null,null,null,null,null,null,"(Step-wise Plot)"]
[2]
[null,null,null,{"$f":"IF(units=1,\"Thickness (m)\",\"Thickness (ft)\")","v":"Thickness (ft)"},null,"Idriss and Boulanger (2008, 2012)",null,null,null,null,null,"Cetin et al. (2004)",null,null,null,null,null,null,"P_L 50% line:",null,null,{"$f":"IF(units=1,\"Thickness (m)\",\"Thickness (ft)\")","v":"Thickness (ft)"},null,"Idriss and Boulanger (2008, 2012)",null,null,null,null,null,"Cetin et al. (2004)"]
["FPGA",null,null,null,{"$f":"IF(units=1,\"Depth (m)\",\"Depth (ft)\")","v":"Depth (ft)"},"(N1)60,cs","Nreqsite","CSRsite","P_L/FS_L","CRR","Settle","(N1)60,cs","Nreqsite","CSRsite","P_L/FS_L","CRR","Settle",null,"Depth","P_L",null,null,{"$f":"IF(units=1,\"Depth (m)\",\"Depth (ft)\")","v":"Depth (ft)"},"(N1)60,cs","Nreqsite","CSRsite","P_L/FS_L","CRR","Settle","(N1)60,cs","Nreqsite","CSRsite","P_L/FS_L","CRR","Settle"]
["A",null,null,{"$f":"IF(Inputs!$G13=\"\",NA(),Inputs!$G13)","v":3},0,{"$f":"'Final Summary'!K26","v":33.874185446686866},{"$f":"'Final Summary'!L26","v":19.147705078125},{"$f":"'Final Summary'!M26","v":0.22311236023806372},{"$f":"'Final Summary'!N26","v":4.531038012233954},{"$f":"'PB Liquefaction Initiation'!Q10","v":1.010930585237902},null,{"$f":"'Final Summary'!P26","v":32.632000000000005},{"$f":"'Final Summary'!Q26","v":42.004928699970996},{"$f":"'Final Summary'!R26","v":2.6853170884224604},{"$f":"'Final Summary'!S26","v":0.5067739356819696},{"$f":"'PB Liquefaction Initiation'!N43","v":1.3608487094538979},null,null,0,0.5,null,{"$f":"IF(Inputs!$G13=\"\",NA(),Inputs!$G13)","v":3},0,{"$f":"'Final Summary'!V26","v":33.874185446686866},{"$f":"'Final Summary'!W26","v":30.872833251953125},{"$f":"'Final Summary'!X26","v":0.41396383811397325},{"$f":"'Final Summary'!Y26","v":1.8540697745700523},{"$f":"'Det Liquefaction Initiation'!T10","v":0.76751784001212797},null,{"$f":"'Final Summary'!AA26","v":32.632000000000005},{"$f":"'Final Summary'!AB26","v":32.02838398000322},{"$f":"'Final Summary'!AC26","v":0.95265995669352044},{"$f":"'Final Summary'!AD26","v":1.6810605542142403},{"$f":"'Det Liquefaction Initiation'!O43","v":1.6014790747769236}]
{"$rows_left_out":56}
{"sheet":"_HiddenCopy","index":13,"n_rows":0,"n_cols":0,"rows_kept":0,"cut":false,"hidden":true,"merged":[[1,2,1,5],[1,7,1,10],[2,7,2,10],[3,7,3,10],[58,5,58,6],[58,9,58,10],[58,1,58,4],[2,2,2,3],[3,2,3,3],[12,22,13,23],[47,1,47,2],[47,5,47,6],[47,9,47,10],[23,10,24,12]]}