{"text_format":"1","workbook":"xlsx","n_sheets":14,"sheets":["Intro","Inputs","Final Summary","Map Help","PB Liquefaction Initiation","Det Liquefaction Initiation","PB Settlement","Det Settlement","Lateral Spread","Slope Displacement","References","Version Notes","_Hidden","_HiddenCopy"],"not_rendered":{"charts":11,"images":31,"macros":1,"external_links":0,"defined_names":87,"comments":3,"pivot_tables":0},"unopened":[],"bounds":{"document_bytes":16777216,"sheet_cells":100000,"rows_first":2000,"rows_last":500,"rows_between":2000,"halvings":0,"cell_chars":16384,"cell_head_chars":4096},"cells_cut":0,"cells_raw":0,"read":"whole","date_system":"1900"}

{"sheet":"Intro","index":0,"n_rows":33,"n_cols":5,"rows_kept":33,"cut":false,"hidden":false,"merged":[[5,1,7,7],[21,2,23,6],[32,1,34,7],[1,1,3,7]]}
[]
[null,"Simplified Performance-based Liquefaction Analysis Tool                            \"SPLiq\""]
[]
[]
[]
[null,"A Simplified, Performance-based Tool for Estimating Liquefaction Hazard, Settlement, Lateral Spread, and Seismic Slope Stability"]
[]
[]
[]
[null,null,null,null,"Levi Ekstrom"]
[null,null,null,null,"Kristin Ulmer"]
[null,null,null,null,"Brian Peterson"]
[null,null,null,null,"Lucy Astorga"]
[null,null,null,null,"Braden Error"]
[null,null,null,null,"Dr. Kevin Franke"]
[]
[]
[null,null,null,null,"July 2022"]
[]
[]
[]
[null,null,"Brigham Young University\nWith special recognition to sponsors through TPF-5(296)"]
[]
[]
[]
[]
[]
[]
[]
[null,null,null,null,"Version: 1.43"]
[null,null,null,null,"Compatible with Excel 2010 and more recent versions"]
[]
[null,"This program has not yet been tested or peer reviewed for accuracy. By using this program, the user agrees to full responsibility for any damages or liability that result from the use of this program or data herein.  The authors are not liable for any damages or liability ensuing as a result of the use of this program or data obtained from this program."]

{"sheet":"Inputs","index":1,"n_rows":67,"n_cols":29,"rows_kept":67,"cut":false,"hidden":false,"merged":[[2,2,2,3],[3,2,3,3],[12,22,13,23],[1,2,1,5],[1,7,1,10],[2,7,2,10],[3,7,3,10],[23,10,24,12],[58,5,58,6],[58,9,58,10],[47,1,47,2],[47,5,47,6],[47,9,47,10],[58,1,58,4]]}
[]
[null,"Company:","GEO Company",null,null,null,"Project Name:","Example Problem"]
[null,"Designer:","BME",null,"Checked By:",null,"Location:","Salt Lake City, UT"]
[null,"Date:","2018-09-05",null,"Date:",null,"Project #:","AB-123-4567",null,null,null,null,null,"= General",null,null,"= Liquefaction-specific",null,null,"= Lateral Spread-specific"]
[null,null,null,null,null,null,null,null,null,null,null,null,null,null,null,null,"=Settlement-specific",null,null,"=Slope Displacement-specific"]
[null,"Units:",2,null,"(1 = SI, 2 = US Customary)",null,"Latitude =",40.674579999999999,"Longitude=",-111.91495,null,null,null,null,"Analysis Selections:",null,null,"*Select \"TRUE\" to run analysis"]
[]
[null,"Site Characteristics:",null,null,null,null,"Return Period:",2475,"yrs"]
[null,null,null,null,null,null,"Probability of Exceedance:",{"$f":"IF(H8=475,\"10% in 50 yrs\",IF(H8=1033,\"7% in 75 yrs\",\"2% in 50 yrs\"))","v":"2% in 50 yrs"},null,null,null,null,null,null,null,null,"Liquefaction Initiation & Settlement:",true]
[null,null,null,"Water Level at Time of Drilling =",5,{"$f":"IF(units=1,\"m\",\"ft\")","v":"ft"},null,null,null,null,null,null,null,null,null,null,"Lateral Spread:",true]
[null,null,null,"Design Water Table Depth =",0,{"$f":"IF(units=1,\"m\",\"ft\")","v":"ft"},"**Maximum of 20 Sublayers** ",null,null,null,null,null,null,null,null,null,"Slope Displacement:",true]
[null,{"$f":"IF(units=1,\"Depth (m)\",\"Depth (ft)\")","v":"Depth (ft)"},"N (bpf)","Sampler Type",{"$f":"IF(units=1,\"γ (kN/m^3)\",\"γ (lb/ft^3)\")","v":"γ (lb/ft^3)"},"Fines (%)",{"$f":"IF(units=1,\"Thickness (m)\",\"Thickness (ft)\")","v":"Thickness (ft)"},"KDR","Soil Type","Susceptible?"]
["Start Here -->",1.5,20,"Standard SS (2-in OD)",124.3,10,3,null,"Granular Fill","Yes",null,"Hammer Efficiency (%)",null,null,null,"Cetin:",true,"B&I/I&Y:",true,null,null,"GS","FF = Free Face \nGS = Ground Slope"]
[null,5.5,14,"Non-Standard (3-in OD)",124.3,10,5,null,"[SM]_Silty_sand","Yes",null,77]
[null,10.5,12,"Non-Standard (2.5-in OD)",124.3,10,5,null,"[SM]_Silty_sand","Yes"]
[null,15,3,"D&M SS (3.25-in OD)",124.3,60,4,null,"[CL]_Clay","No",null,"Borehole Diameter",null,null,null,"PL/FSL:","FSL","PL = Probability of Liq.",null,null,"R&S:",true,"B&T:",true]
[null,20.5,27,"Custom Factor",124.3,10,7,null,"[SM]_Silty_sand","Yes",null,4.25,{"$f":"IF(units=1,\"mm\",\"in\")","v":"in"},null,null,null,null,"FSL = Factor of Safety"]
[null,25.5,22,"Standard SS (2-in OD)",124.3,10,3,null,"[SM]_Silty_sand","Yes"]
[null,30.5,16,"Standard SS (2-in OD)",124.3,10,7,null,"[SM]_Silty_sand","Yes",null,"Rod Stickup Length"]
[null,35.5,13,"Custom Factor",124.3,10,3,null,"[SM]_Silty_sand","Yes",null,5,{"$f":"IF(units=1,\"m\",\"ft\")","v":"ft"}]
[null,41,3,"Custom Factor",124.3,70,8,null,"[CL]_Clay","No",null,null,null,null,null,null,"Liquefaction Initiation & Settlement:",true]
[null,45,3,"Custom Factor",124.3,5,3,null,"[SM]_Silty_sand","Yes",null,"Liner Type",null,null,null,null,"Lateral Spread:",true]
[null,51.5,18,"Custom Factor",124.3,5,7,null,"[SM]_Silty_sand","Yes",null,"L",null,null,null,null,"Slope Displacement:",true]
[null,57,5,"Custom Factor",124.3,5,4,null,"[SM]_Silty_sand","Yes","L = Standard Split Spoon\nNL = Room for liners, but no liners\n"]
[]
[null,null,null,null,null,null,null,null,null,null,null,"Convert SPT N Custom Factor:"]
[null,null,null,null,null,null,null,null,null,null,null,0.55000000000000004]
[]
[]
[]
[]
[]
[]
[null,"Ground Motion Parameters:",null,null,null,"Site Lateral Spread Parameters:",null,null,null,"Site Slope Disp. Parameters:"]
[]
[null,"PGA =",0.44,null,null,"S =",1.5,"%",null,"ky=",0.2,null,null,null,null,null,null,null,null,null,null,null,null,null,null,null,null,null,"A"]
[null,"FPGA =",1.06,null,null,"W =",16,"%",null,null,null,null,1,15,null,null,null,null,null,null,null,null,null,null,null,null,null,null,"B"]
[null,"Mw =",6.77,null,null,"T15 =",10,{"$f":"IF(units=1,\"m\",\"ft\")","v":"ft"},{"$f":"IF(H38=\"m\",M37,M38)","v":3.2808398950131235},{"$f":"IF(H38=\"m\",N37,N38)","v":49.212598425196852},null,null,{"$f":"CONVERT(M37,\"m\",\"ft\")","v":3.2808398950131235},{"$f":"CONVERT(N37,\"m\",\"ft\")","v":49.212598425196852},null,null,null,null,null,null,null,null,null,null,null,null,null,null,"C"]
[null,"Vs,12 =",623,{"$f":"IF(units=1,\"m/s\",\"ft/s\")","v":"ft/s"},null,"F15 =",11,"%",null,null,null,null,null,null,null,null,null,null,null,null,null,null,null,null,null,null,null,null,"D"]
[null,"Site Class =","D",null,null,"D5015 =",5,"mm",null,null,null,null,null,null,null,null,null,null,null,null,null,null,null,null,null,null,null,null,"E"]
[null,null,null,null,null,null,null,null,null,null,null,null,null,null,null,null,null,null,null,null,null,null,null,null,null,null,null,null,"F"]
[null,null,1,"1 = Calculate FPGA Automatically\n"]
[null,null,null,"2 = User-defined FPGA value entered in box above"]
[null,"MSF:",2014]
[]
[null,"Mapped/Interpolated Reference Values:"]
[]
[null,"Liq. Initiation/Settlement:",null,null,null,"Lateral Spread Disp:",null,null,null,"Seismic Slope Disp:"]
[]
[null,"CSR(%)ref =",35.14,null,null,"Log Dhref =",0.55000000000000004,null,null,"DR&Sref =",2.4300000000000002]
[null,"Nreqref =",49.09,null,null,null,null,null,null,"DB&Tref =",2.65]
[null,"εv,Cetin(%)ref =",2.2999999999999998]
[null,"εv,I&Y(%)ref =",2.2999999999999998]
[]
[]
[]
[null,"Deterministic Analysis Parameters:"]
[]
[null,"Liq. Initiation/Settlement/Slope Disp:",null,null,null,"Lateral Spread Disp:",null,null,null,"Seismic Slope Disp:"]
[]
[null,"PGA =",0.73,null,null,"Distance =",1.1100000000000001,"km",null,"Percentile =",85]
[null,"FPGA =",1,null,null,"Mw =",7]
[null,"Mw =",6.8,null,null,"Percentile =",85]
[null,"Percentile =",84]
[]
[null,null,1,"1 = Calculate FPGA automatically\n"]
[null,null,null,"2 = User-defined FPGA value entered in box above"]

{"sheet":"Final Summary","index":2,"n_rows":46,"n_cols":40,"rows_kept":46,"cut":false,"hidden":false,"merged":[[39,38,40,38],[39,32,40,32],[39,33,40,33],[39,34,40,34],[39,36,40,36],[39,37,40,37],[25,37,25,39],[35,31,36,33],[35,35,36,37],[37,32,38,32],[37,33,38,33],[37,34,38,34],[37,36,38,36],[37,37,38,37],[37,38,38,38],[0,13,0,14],[1,13,1,14],[2,13,2,14],[0,15,0,19],[1,15,1,19],[2,15,2,19],[0,10,0,12],[0,1,0,3],[0,5,0,8],[1,5,1,8],[2,5,2,8],[0,36,0,39],[1,36,1,39],[2,36,2,39],[0,21,0,23],[0,24,0,25],[0,26,0,30],[1,24,1,25],[1,26,1,30],[2,24,2,25],[2,26,2,30],[0,32,0,34],[41,4,41,6],[18,38,19,38],[16,31,17,33],[16,35,17,37],[6,34,6,36],[23,21,23,25],[23,26,23,30],[6,37,6,39],[18,33,19,33],[18,37,19,37],[18,32,19,32],[18,34,19,34],[18,36,19,36],[23,10,23,14],[23,15,23,19],[25,34,25,35]]}
["Company:",{"$f":"IF(Inputs!$C$2=\"\",\"\",Inputs!$C$2)","v":"GEO Company"},null,null,"Project:",{"$f":"IF(Inputs!$H$2=\"\",\"\",Inputs!$H$2)","v":"Example Problem"},null,null,null,"Company:",{"$f":"IF(Inputs!$C$2=\"\",\"\",Inputs!$C$2)","v":"GEO Company"},null,null,"Project:",null,{"$f":"IF(Inputs!$H$2=\"\",\"\",Inputs!$H$2)","v":"Example Problem"},null,null,null,null,"Company:",{"$f":"IF(Inputs!$C$2=\"\",\"\",Inputs!$C$2)","v":"GEO Company"},null,null,"Project:",null,{"$f":"IF(Inputs!$H$2=\"\",\"\",Inputs!$H$2)","v":"Example Problem"},null,null,null,null,"Company:",{"$f":"IF(Inputs!$C$2=\"\",\"\",Inputs!$C$2)","v":"GEO Company"},null,null,"Project:",{"$f":"IF(Inputs!$H$2=\"\",\"\",Inputs!$H$2)","v":"Example Problem"}]
["Designer:",{"$f":"IF(Inputs!$C$3=\"\",\"\",Inputs!$C$3)","v":"BME"},"Checked by:",{"$f":"IF(Inputs!$F$3=\"\",\"\",Inputs!$F$3)","v":""},"Location:",{"$f":"IF(Inputs!$H$3=\"\",\"\",Inputs!$H$3)","v":"Salt Lake City, UT"},{"$f":"IF(Inputs!I3=\"\",\"\",Inputs!I3)","v":""},{"$f":"IF(Inputs!J3=\"\",\"\",Inputs!J3)","v":""},{"$f":"IF(Inputs!K3=\"\",\"\",Inputs!K3)","v":""},"Designer:",{"$f":"IF(Inputs!$C$3=\"\",\"\",Inputs!$C$3)","v":"BME"},"Checked:",{"$f":"IF(Inputs!$F$3=\"\",\"\",Inputs!$F$3)","v":""},"Location:",null,{"$f":"IF(Inputs!$H$3=\"\",\"\",Inputs!$H$3)","v":"Salt Lake City, UT"},null,null,null,null,"Designer:",{"$f":"IF(Inputs!$C$3=\"\",\"\",Inputs!$C$3)","v":"BME"},"Checked:",{"$f":"IF(Inputs!$F$3=\"\",\"\",Inputs!$F$3)","v":""},"Location:",null,{"$f":"IF(Inputs!$H$3=\"\",\"\",Inputs!$H$3)","v":"Salt Lake City, UT"},null,null,null,null,"Designer:",{"$f":"IF(Inputs!$C$3=\"\",\"\",Inputs!$C$3)","v":"BME"},"Checked:",{"$f":"IF(Inputs!$F$3=\"\",\"\",Inputs!$F$3)","v":""},"Location:",{"$f":"IF(Inputs!$H$3=\"\",\"\",Inputs!$H$3)","v":"Salt Lake City, UT"},{"$f":"IF(Inputs!AN3=\"\",\"\",Inputs!AN3)","v":""},{"$f":"IF(Inputs!AO3=\"\",\"\",Inputs!AO3)","v":""},{"$f":"IF(Inputs!AP3=\"\",\"\",Inputs!AP3)","v":""}]
["Date:",{"$f":"IF(Inputs!$C$4=\"\",\"\",Inputs!$C$4)","v":"2018-09-05"},"Date:",{"$f":"IF(Inputs!$F$4=\"\",\"\",Inputs!$F$4)","v":""},"Project #:",{"$f":"IF(Inputs!$H$4=\"\",\"\",Inputs!$H$4)","v":"AB-123-4567"},{"$f":"IF(Inputs!I4=\"\",\"\",Inputs!I4)","v":""},{"$f":"IF(Inputs!J4=\"\",\"\",Inputs!J4)","v":""},{"$f":"IF(Inputs!K4=\"\",\"\",Inputs!K4)","v":""},"Date:",{"$f":"IF(Inputs!$C$4=\"\",\"\",Inputs!$C$4)","v":"2018-09-05"},"Date:",{"$f":"IF(Inputs!$F$4=\"\",\"\",Inputs!$F$4)","v":""},"Project #:",null,{"$f":"IF(Inputs!$H$4=\"\",\"\",Inputs!$H$4)","v":"AB-123-4567"},null,null,null,null,"Date:",{"$f":"IF(Inputs!$C$4=\"\",\"\",Inputs!$C$4)","v":"2018-09-05"},"Date:",{"$f":"IF(Inputs!$F$4=\"\",\"\",Inputs!$F$4)","v":""},"Project #:",null,{"$f":"IF(Inputs!$H$4=\"\",\"\",Inputs!$H$4)","v":"AB-123-4567"},null,null,null,null,"Date:",{"$f":"IF(Inputs!$C$4=\"\",\"\",Inputs!$C$4)","v":"2018-09-05"},"Date:",{"$f":"IF(Inputs!$F$4=\"\",\"\",Inputs!$F$4)","v":""},"Project #:",{"$f":"IF(Inputs!$H$4=\"\",\"\",Inputs!$H$4)","v":"AB-123-4567"},{"$f":"IF(Inputs!AN4=\"\",\"\",Inputs!AN4)","v":""},{"$f":"IF(Inputs!AO4=\"\",\"\",Inputs!AO4)","v":""},{"$f":"IF(Inputs!AP4=\"\",\"\",Inputs!AP4)","v":""}]
[]
["Summary of Inputs for Liquefaction Initiation:",null,null,null,null,null,null,null,null,"Liquefaction Initiation and Settlement Simplified Performance-based Results:",null,null,null,null,null,null,null,null,null,null,"Liquefaction Initiation and Settlement Deterministic Results:",null,null,null,null,null,null,null,null,null,null,"Summary of Inputs for Lateral Spread Analysis:"]
[null,null,null,null,null,null,"Hammer Efficiency =",{"$f":"IF(Hammer_Eff=\"\",\"\",Hammer_Eff)","v":77},"%"]
[null,null,"Water Level at Time of Drilling =",{"$f":"IF(gw_depth=\"\",\"\",gw_depth)","v":5},{"$f":"IF(units=1,\"m\",\"ft\")","v":"ft"},null,"Borehole Diameter =",{"$f":"IF(Bore_Diam=\"\",\"\",Bore_Diam)","v":4.25},{"$f":"IF(units=1,\"mm\",\"in\")","v":"in"},null,null,null,null,null,null,null,null,null,null,null,null,null,null,null,null,null,null,null,null,null,null,null,"Site Characteristics",null,"Mapped Reference Value",null,null,"Inputs for Deterministic Analysis"]
[null,null,"Design Water Table Depth =",{"$f":"IF(design_gw=\"\",\"\",design_gw)","v":0},{"$f":"IF(units=1,\"m\",\"ft\")","v":"ft"},null,"Rod Stickup Length =",{"$f":"IF(Rod_stickup=\"\",\"\",Rod_stickup)","v":5},{"$f":"IF(units=1,\"m\",\"ft\")","v":"ft"},null,null,null,null,null,null,null,null,null,null,null,null,null,null,null,null,null,null,null,null,null,null,"S =",{"$f":"IF(S_prob=\"\",\"\",S_prob)","v":1.5},"%","Log Dhref =",{"$f":"IF(Dh_ref=\"\",\"\",Dh_ref)","v":0.55000000000000004},null,"Distance =",{"$f":"IF(R_LS_det=\"\",\"\",R_LS_det)","v":1.1100000000000001}]
[null,null,null,null,null,null,null,null,null,null,null,null,null,null,null,null,null,null,null,null,null,null,null,null,null,null,null,null,null,null,null,"W =",{"$f":"IF(W_prob=\"\",\"\",W_prob)","v":16},"%","TR =",{"$f":"IF(Tr=\"\",\"\",Tr)","v":2475},"yrs","Mw =",{"$f":"IF(Mw_LS_det=\"\",\"\",Mw_LS_det)","v":7}]
[{"$f":"IF(units=1,\"Depth (m)\", \"Depth (ft)\")","v":"Depth (ft)"},"N (bpf)","Sampler Type",{"$f":"IF(units=1,\"γ (kN/m^3)\",\"γ (lb/ft^3)\")","v":"γ (lb/ft^3)"},"Fines (%)",{"$f":"IF(units=1,\"Thickness (m)\",\"Thickness (ft)\")","v":"Thickness (ft)"},"KDR","Soil Type","Susceptible?",null,null,null,null,null,null,null,null,null,null,null,null,null,null,null,null,null,null,null,null,null,null,"T15 =",{"$f":"IF(T15_prob=\"\",\"\",T15_prob)","v":10},{"$f":"IF(units=1,\"m\",\"ft\")","v":"ft"},null,null,null,"Percentile =",{"$f":"IF(Percentile_LS=\"\",\"\",Percentile_LS)","v":85}]
[{"$f":"IF(Inputs!B13=\"\",\"\",Inputs!B13)","v":1.5},{"$f":"IF(Inputs!C13=\"\",\"\",Inputs!C13)","v":20},{"$f":"IF(Inputs!D13=\"\",\"\",IF(Inputs!D13=\"Standard SS (2-in OD)\",\"Standard\",IF(Inputs!D13=\"Non-Standard (3-in OD)\", \"3-in OD\",IF(Inputs!D13=\"Non-Standard (2.5-in OD)\",\"2.5-in OD\",IF(Inputs!D13=\"D&M SS (3.25-in OD)\",\"3.25-in OD\",\"Custom\")))))","v":"Standard"},{"$f":"IF(Inputs!E13=\"\",\"\",Inputs!E13)","v":124.3},{"$f":"IF(Inputs!F13=\"\",\"\",Inputs!F13)","v":10},{"$f":"IF(Inputs!G13=\"\",\"\",Inputs!G13)","v":3},{"$f":"IF(Inputs!H13=\"\",\"\",Inputs!H13)","v":""},{"$f":"IF(Inputs!I13=\"\",\"\",Inputs!I13)","v":"Granular Fill"},{"$f":"IF(Inputs!J13=\"\",\"\",Inputs!J13)","v":"Yes"},null,null,null,null,null,null,null,null,null,null,null,null,null,null,null,null,null,null,null,null,null,null,"F15 =",{"$f":"IF(F15_prob=\"\",\"\",F15_prob)","v":11},"%"]
[{"$f":"IF(Inputs!B14=\"\",\"\",Inputs!B14)","v":5.5},{"$f":"IF(Inputs!C14=\"\",\"\",Inputs!C14)","v":14},{"$f":"IF(Inputs!D14=\"\",\"\",IF(Inputs!D14=\"Standard SS (2-in OD)\",\"Standard\",IF(Inputs!D14=\"Non-Standard (3-in OD)\", \"3-in OD\",IF(Inputs!D14=\"Non-Standard (2.5-in OD)\",\"2.5-in OD\",IF(Inputs!D14=\"D&M SS (3.25-in OD)\",\"3.25-in OD\",\"Custom\")))))","v":"3-in OD"},{"$f":"IF(Inputs!E14=\"\",\"\",Inputs!E14)","v":124.3},{"$f":"IF(Inputs!F14=\"\",\"\",Inputs!F14)","v":10},{"$f":"IF(Inputs!G14=\"\",\"\",Inputs!G14)","v":5},{"$f":"IF(Inputs!H14=\"\",\"\",Inputs!H14)","v":""},{"$f":"IF(Inputs!I14=\"\",\"\",Inputs!I14)","v":"[SM]_Silty_sand"},{"$f":"IF(Inputs!J14=\"\",\"\",Inputs!J14)","v":"Yes"},null,null,null,null,null,null,null,null,null,null,null,null,null,null,null,null,null,null,null,null,null,null,"D50 =",{"$f":"IF(D50_prob=\"\",\"\",D50_prob)","v":5},"mm"]
[{"$f":"IF(Inputs!B15=\"\",\"\",Inputs!B15)","v":10.5},{"$f":"IF(Inputs!C15=\"\",\"\",Inputs!C15)","v":12},{"$f":"IF(Inputs!D15=\"\",\"\",IF(Inputs!D15=\"Standard SS (2-in OD)\",\"Standard\",IF(Inputs!D15=\"Non-Standard (3-in OD)\", \"3-in OD\",IF(Inputs!D15=\"Non-Standard (2.5-in OD)\",\"2.5-in OD\",IF(Inputs!D15=\"D&M SS (3.25-in OD)\",\"3.25-in OD\",\"Custom\")))))","v":"2.5-in OD"},{"$f":"IF(Inputs!E15=\"\",\"\",Inputs!E15)","v":124.3},{"$f":"IF(Inputs!F15=\"\",\"\",Inputs!F15)","v":10},{"$f":"IF(Inputs!G15=\"\",\"\",Inputs!G15)","v":5},{"$f":"IF(Inputs!H15=\"\",\"\",Inputs!H15)","v":""},{"$f":"IF(Inputs!I15=\"\",\"\",Inputs!I15)","v":"[SM]_Silty_sand"},{"$f":"IF(Inputs!J15=\"\",\"\",Inputs!J15)","v":"Yes"}]
[{"$f":"IF(Inputs!B16=\"\",\"\",Inputs!B16)","v":15},{"$f":"IF(Inputs!C16=\"\",\"\",Inputs!C16)","v":3},{"$f":"IF(Inputs!D16=\"\",\"\",IF(Inputs!D16=\"Standard SS (2-in OD)\",\"Standard\",IF(Inputs!D16=\"Non-Standard (3-in OD)\", \"3-in OD\",IF(Inputs!D16=\"Non-Standard (2.5-in OD)\",\"2.5-in OD\",IF(Inputs!D16=\"D&M SS (3.25-in OD)\",\"3.25-in OD\",\"Custom\")))))","v":"3.25-in OD"},{"$f":"IF(Inputs!E16=\"\",\"\",Inputs!E16)","v":124.3},{"$f":"IF(Inputs!F16=\"\",\"\",Inputs!F16)","v":60},{"$f":"IF(Inputs!G16=\"\",\"\",Inputs!G16)","v":4},{"$f":"IF(Inputs!H16=\"\",\"\",Inputs!H16)","v":""},{"$f":"IF(Inputs!I16=\"\",\"\",Inputs!I16)","v":"[CL]_Clay"},{"$f":"IF(Inputs!J16=\"\",\"\",Inputs!J16)","v":"No"}]
[{"$f":"IF(Inputs!B17=\"\",\"\",Inputs!B17)","v":20.5},{"$f":"IF(Inputs!C17=\"\",\"\",Inputs!C17)","v":27},{"$f":"IF(Inputs!D17=\"\",\"\",IF(Inputs!D17=\"Standard SS (2-in OD)\",\"Standard\",IF(Inputs!D17=\"Non-Standard (3-in OD)\", \"3-in OD\",IF(Inputs!D17=\"Non-Standard (2.5-in OD)\",\"2.5-in OD\",IF(Inputs!D17=\"D&M SS (3.25-in OD)\",\"3.25-in OD\",\"Custom\")))))","v":"Custom"},{"$f":"IF(Inputs!E17=\"\",\"\",Inputs!E17)","v":124.3},{"$f":"IF(Inputs!F17=\"\",\"\",Inputs!F17)","v":10},{"$f":"IF(Inputs!G17=\"\",\"\",Inputs!G17)","v":7},{"$f":"IF(Inputs!H17=\"\",\"\",Inputs!H17)","v":""},{"$f":"IF(Inputs!I17=\"\",\"\",Inputs!I17)","v":"[SM]_Silty_sand"},{"$f":"IF(Inputs!J17=\"\",\"\",Inputs!J17)","v":"Yes"},null,null,null,null,null,null,null,null,null,null,null,null,null,null,null,null,null,null,null,null,null,null,"Lateral Spread Displacement Results:"]
[{"$f":"IF(Inputs!B18=\"\",\"\",Inputs!B18)","v":25.5},{"$f":"IF(Inputs!C18=\"\",\"\",Inputs!C18)","v":22},{"$f":"IF(Inputs!D18=\"\",\"\",IF(Inputs!D18=\"Standard SS (2-in OD)\",\"Standard\",IF(Inputs!D18=\"Non-Standard (3-in OD)\", \"3-in OD\",IF(Inputs!D18=\"Non-Standard (2.5-in OD)\",\"2.5-in OD\",IF(Inputs!D18=\"D&M SS (3.25-in OD)\",\"3.25-in OD\",\"Custom\")))))","v":"Standard"},{"$f":"IF(Inputs!E18=\"\",\"\",Inputs!E18)","v":124.3},{"$f":"IF(Inputs!F18=\"\",\"\",Inputs!F18)","v":10},{"$f":"IF(Inputs!G18=\"\",\"\",Inputs!G18)","v":3},{"$f":"IF(Inputs!H18=\"\",\"\",Inputs!H18)","v":""},{"$f":"IF(Inputs!I18=\"\",\"\",Inputs!I18)","v":"[SM]_Silty_sand"},{"$f":"IF(Inputs!J18=\"\",\"\",Inputs!J18)","v":"Yes"}]
[{"$f":"IF(Inputs!B19=\"\",\"\",Inputs!B19)","v":30.5},{"$f":"IF(Inputs!C19=\"\",\"\",Inputs!C19)","v":16},{"$f":"IF(Inputs!D19=\"\",\"\",IF(Inputs!D19=\"Standard SS (2-in OD)\",\"Standard\",IF(Inputs!D19=\"Non-Standard (3-in OD)\", \"3-in OD\",IF(Inputs!D19=\"Non-Standard (2.5-in OD)\",\"2.5-in OD\",IF(Inputs!D19=\"D&M SS (3.25-in OD)\",\"3.25-in OD\",\"Custom\")))))","v":"Standard"},{"$f":"IF(Inputs!E19=\"\",\"\",Inputs!E19)","v":124.3},{"$f":"IF(Inputs!F19=\"\",\"\",Inputs!F19)","v":10},{"$f":"IF(Inputs!G19=\"\",\"\",Inputs!G19)","v":7},{"$f":"IF(Inputs!H19=\"\",\"\",Inputs!H19)","v":""},{"$f":"IF(Inputs!I19=\"\",\"\",Inputs!I19)","v":"[SM]_Silty_sand"},{"$f":"IF(Inputs!J19=\"\",\"\",Inputs!J19)","v":"Yes"},null,null,null,null,null,null,null,null,null,null,null,null,null,null,null,null,null,null,null,null,null,null,"Simplified PB Results:",null,null,null,"Deterministic Results:"]
[{"$f":"IF(Inputs!B20=\"\",\"\",Inputs!B20)","v":35.5},{"$f":"IF(Inputs!C20=\"\",\"\",Inputs!C20)","v":13},{"$f":"IF(Inputs!D20=\"\",\"\",IF(Inputs!D20=\"Standard SS (2-in OD)\",\"Standard\",IF(Inputs!D20=\"Non-Standard (3-in OD)\", \"3-in OD\",IF(Inputs!D20=\"Non-Standard (2.5-in OD)\",\"2.5-in OD\",IF(Inputs!D20=\"D&M SS (3.25-in OD)\",\"3.25-in OD\",\"Custom\")))))","v":"Custom"},{"$f":"IF(Inputs!E20=\"\",\"\",Inputs!E20)","v":124.3},{"$f":"IF(Inputs!F20=\"\",\"\",Inputs!F20)","v":10},{"$f":"IF(Inputs!G20=\"\",\"\",Inputs!G20)","v":3},{"$f":"IF(Inputs!H20=\"\",\"\",Inputs!H20)","v":""},{"$f":"IF(Inputs!I20=\"\",\"\",Inputs!I20)","v":"[SM]_Silty_sand"},{"$f":"IF(Inputs!J20=\"\",\"\",Inputs!J20)","v":"Yes"}]
[{"$f":"IF(Inputs!B21=\"\",\"\",Inputs!B21)","v":41},{"$f":"IF(Inputs!C21=\"\",\"\",Inputs!C21)","v":3},{"$f":"IF(Inputs!D21=\"\",\"\",IF(Inputs!D21=\"Standard SS (2-in OD)\",\"Standard\",IF(Inputs!D21=\"Non-Standard (3-in OD)\", \"3-in OD\",IF(Inputs!D21=\"Non-Standard (2.5-in OD)\",\"2.5-in OD\",IF(Inputs!D21=\"D&M SS (3.25-in OD)\",\"3.25-in OD\",\"Custom\")))))","v":"Custom"},{"$f":"IF(Inputs!E21=\"\",\"\",Inputs!E21)","v":124.3},{"$f":"IF(Inputs!F21=\"\",\"\",Inputs!F21)","v":70},{"$f":"IF(Inputs!G21=\"\",\"\",Inputs!G21)","v":8},{"$f":"IF(Inputs!H21=\"\",\"\",Inputs!H21)","v":""},{"$f":"IF(Inputs!I21=\"\",\"\",Inputs!I21)","v":"[CL]_Clay"},{"$f":"IF(Inputs!J21=\"\",\"\",Inputs!J21)","v":"No"},null,null,null,null,null,null,null,null,null,null,null,null,null,null,null,null,null,null,null,null,null,null,null," Dhsite =",{"$f":"IF(Simp_LS_Option=TRUE,IF(units=2,CONVERT('Lateral Spread'!C25,\"m\",\"ft\"),'Lateral Spread'!C25),NA())","v":2.0305882241243816},{"$f":"IF(units=1,\"m\",\"ft\")","v":"ft"},null,"Dh =",{"$f":"IF(Det_LS_option=TRUE,IF(units=2,CONVERT('Lateral Spread'!G25,\"m\",\"ft\"),'Lateral Spread'!G25),NA())","v":4.4327592429895875},{"$f":"IF(units=1,\"m\",\"ft\")","v":"ft"}]
[{"$f":"IF(Inputs!B22=\"\",\"\",Inputs!B22)","v":45},{"$f":"IF(Inputs!C22=\"\",\"\",Inputs!C22)","v":3},{"$f":"IF(Inputs!D22=\"\",\"\",IF(Inputs!D22=\"Standard SS (2-in OD)\",\"Standard\",IF(Inputs!D22=\"Non-Standard (3-in OD)\", \"3-in OD\",IF(Inputs!D22=\"Non-Standard (2.5-in OD)\",\"2.5-in OD\",IF(Inputs!D22=\"D&M SS (3.25-in OD)\",\"3.25-in OD\",\"Custom\")))))","v":"Custom"},{"$f":"IF(Inputs!E22=\"\",\"\",Inputs!E22)","v":124.3},{"$f":"IF(Inputs!F22=\"\",\"\",Inputs!F22)","v":5},{"$f":"IF(Inputs!G22=\"\",\"\",Inputs!G22)","v":3},{"$f":"IF(Inputs!H22=\"\",\"\",Inputs!H22)","v":""},{"$f":"IF(Inputs!I22=\"\",\"\",Inputs!I22)","v":"[SM]_Silty_sand"},{"$f":"IF(Inputs!J22=\"\",\"\",Inputs!J22)","v":"Yes"}]
[{"$f":"IF(Inputs!B23=\"\",\"\",Inputs!B23)","v":51.5},{"$f":"IF(Inputs!C23=\"\",\"\",Inputs!C23)","v":18},{"$f":"IF(Inputs!D23=\"\",\"\",IF(Inputs!D23=\"Standard SS (2-in OD)\",\"Standard\",IF(Inputs!D23=\"Non-Standard (3-in OD)\", \"3-in OD\",IF(Inputs!D23=\"Non-Standard (2.5-in OD)\",\"2.5-in OD\",IF(Inputs!D23=\"D&M SS (3.25-in OD)\",\"3.25-in OD\",\"Custom\")))))","v":"Custom"},{"$f":"IF(Inputs!E23=\"\",\"\",Inputs!E23)","v":124.3},{"$f":"IF(Inputs!F23=\"\",\"\",Inputs!F23)","v":5},{"$f":"IF(Inputs!G23=\"\",\"\",Inputs!G23)","v":7},{"$f":"IF(Inputs!H23=\"\",\"\",Inputs!H23)","v":""},{"$f":"IF(Inputs!I23=\"\",\"\",Inputs!I23)","v":"[SM]_Silty_sand"},{"$f":"IF(Inputs!J23=\"\",\"\",Inputs!J23)","v":"Yes"}]
[{"$f":"IF(Inputs!B24=\"\",\"\",Inputs!B24)","v":57},{"$f":"IF(Inputs!C24=\"\",\"\",Inputs!C24)","v":5},{"$f":"IF(Inputs!D24=\"\",\"\",IF(Inputs!D24=\"Standard SS (2-in OD)\",\"Standard\",IF(Inputs!D24=\"Non-Standard (3-in OD)\", \"3-in OD\",IF(Inputs!D24=\"Non-Standard (2.5-in OD)\",\"2.5-in OD\",IF(Inputs!D24=\"D&M SS (3.25-in OD)\",\"3.25-in OD\",\"Custom\")))))","v":"Custom"},{"$f":"IF(Inputs!E24=\"\",\"\",Inputs!E24)","v":124.3},{"$f":"IF(Inputs!F24=\"\",\"\",Inputs!F24)","v":5},{"$f":"IF(Inputs!G24=\"\",\"\",Inputs!G24)","v":4},{"$f":"IF(Inputs!H24=\"\",\"\",Inputs!H24)","v":""},{"$f":"IF(Inputs!I24=\"\",\"\",Inputs!I24)","v":"[SM]_Silty_sand"},{"$f":"IF(Inputs!J24=\"\",\"\",Inputs!J24)","v":"Yes"}]
[{"$f":"IF(Inputs!B25=\"\",\"\",Inputs!B25)","v":""},{"$f":"IF(Inputs!C25=\"\",\"\",Inputs!C25)","v":""},{"$f":"IF(Inputs!D25=\"\",\"\",IF(Inputs!D25=\"Standard SS (2-in OD)\",\"Standard\",IF(Inputs!D25=\"Non-Standard (3-in OD)\", \"3-in OD\",IF(Inputs!D25=\"Non-Standard (2.5-in OD)\",\"2.5-in OD\",IF(Inputs!D25=\"D&M SS (3.25-in OD)\",\"3.25-in OD\",\"Custom\")))))","v":""},{"$f":"IF(Inputs!E25=\"\",\"\",Inputs!E25)","v":""},{"$f":"IF(Inputs!F25=\"\",\"\",Inputs!F25)","v":""},{"$f":"IF(Inputs!G25=\"\",\"\",Inputs!G25)","v":""},{"$f":"IF(Inputs!H25=\"\",\"\",Inputs!H25)","v":""},{"$f":"IF(Inputs!I25=\"\",\"\",Inputs!I25)","v":""},{"$f":"IF(Inputs!J25=\"\",\"\",Inputs!J25)","v":""}]
[{"$f":"IF(Inputs!B26=\"\",\"\",Inputs!B26)","v":""},{"$f":"IF(Inputs!C26=\"\",\"\",Inputs!C26)","v":""},{"$f":"IF(Inputs!D26=\"\",\"\",IF(Inputs!D26=\"Standard SS (2-in OD)\",\"Standard\",IF(Inputs!D26=\"Non-Standard (3-in OD)\", \"3-in OD\",IF(Inputs!D26=\"Non-Standard (2.5-in OD)\",\"2.5-in OD\",IF(Inputs!D26=\"D&M SS (3.25-in OD)\",\"3.25-in OD\",\"Custom\")))))","v":""},{"$f":"IF(Inputs!E26=\"\",\"\",Inputs!E26)","v":""},{"$f":"IF(Inputs!F26=\"\",\"\",Inputs!F26)","v":""},{"$f":"IF(Inputs!G26=\"\",\"\",Inputs!G26)","v":""},{"$f":"IF(Inputs!H26=\"\",\"\",Inputs!H26)","v":""},{"$f":"IF(Inputs!I26=\"\",\"\",Inputs!I26)","v":""},{"$f":"IF(Inputs!J26=\"\",\"\",Inputs!J26)","v":""},null,"Idriss and Boulanger (2008, 2012); Ishihara & Yoshimine (1992)",null,null,null,null,"Cetin et al. (2004, 2009)",null,null,null,null,null,"Idriss and Boulanger (2008, 2012); Ishihara & Yoshimine (1992)",null,null,null,null,"Cetin et al. (2004, 2009)",null,null,null,null,"Summary of Inputs for Seismic Slope Displacement Analysis:"]
[{"$f":"IF(Inputs!B27=\"\",\"\",Inputs!B27)","v":""},{"$f":"IF(Inputs!C27=\"\",\"\",Inputs!C27)","v":""},{"$f":"IF(Inputs!D27=\"\",\"\",IF(Inputs!D27=\"Standard SS (2-in OD)\",\"Standard\",IF(Inputs!D27=\"Non-Standard (3-in OD)\", \"3-in OD\",IF(Inputs!D27=\"Non-Standard (2.5-in OD)\",\"2.5-in OD\",IF(Inputs!D27=\"D&M SS (3.25-in OD)\",\"3.25-in OD\",\"Custom\")))))","v":""},{"$f":"IF(Inputs!E27=\"\",\"\",Inputs!E27)","v":""},{"$f":"IF(Inputs!F27=\"\",\"\",Inputs!F27)","v":""},{"$f":"IF(Inputs!G27=\"\",\"\",Inputs!G27)","v":""},{"$f":"IF(Inputs!H27=\"\",\"\",Inputs!H27)","v":""},{"$f":"IF(Inputs!I27=\"\",\"\",Inputs!I27)","v":""},{"$f":"IF(Inputs!J27=\"\",\"\",Inputs!J27)","v":""},{"$f":"IF(units=1,\"Depth (m)\",\"Depth (ft)\")","v":"Depth (ft)"},"(N1)60,cs","Nreqsite","CSRsite",{"$f":"IF(Option_PL_FSL=\"FSL\",\"FS_L\",\"P_L\")","v":"FS_L"},{"$f":"\"∑S\" & IF(units=1,\" [cm]\",\" [in]\")","v":"∑S [in]"},"(N1)60,cs","Nreqsite","CSRsite",{"$f":"IF(Option_PL_FSL=\"FSL\",\"FS_L\",\"P_L\")","v":"FS_L"},{"$f":"\"∑S\" & IF(units=1,\" [cm]\",\" [in]\")","v":"∑S [in]"},{"$f":"IF(units=1,\"Depth (m)\",\"Depth (ft)\")","v":"Depth (ft)"},"(N1)60,cs","Nreqsite","CSRsite",{"$f":"IF(Option_PL_FSL=\"FSL\",\"FS_L\",\"P_L\")","v":"FS_L"},{"$f":"\"∑S\" & IF(units=1,\" [cm]\",\" [in]\")","v":"∑S [in]"},"(N1)60,cs","Nreqsite","CSRsite",{"$f":"IF(Option_PL_FSL=\"FSL\",\"FS_L\",\"P_L\")","v":"FS_L"},{"$f":"\"∑S\" & IF(units=1,\" [cm]\",\" [in]\")","v":"∑S [in]"}]
[{"$f":"IF(Inputs!B28=\"\",\"\",Inputs!B28)","v":""},{"$f":"IF(Inputs!C28=\"\",\"\",Inputs!C28)","v":""},{"$f":"IF(Inputs!D28=\"\",\"\",IF(Inputs!D28=\"Standard SS (2-in OD)\",\"Standard\",IF(Inputs!D28=\"Non-Standard (3-in OD)\", \"3-in OD\",IF(Inputs!D28=\"Non-Standard (2.5-in OD)\",\"2.5-in OD\",IF(Inputs!D28=\"D&M SS (3.25-in OD)\",\"3.25-in OD\",\"Custom\")))))","v":""},{"$f":"IF(Inputs!E28=\"\",\"\",Inputs!E28)","v":""},{"$f":"IF(Inputs!F28=\"\",\"\",Inputs!F28)","v":""},{"$f":"IF(Inputs!G28=\"\",\"\",Inputs!G28)","v":""},{"$f":"IF(Inputs!H28=\"\",\"\",Inputs!H28)","v":""},{"$f":"IF(Inputs!I28=\"\",\"\",Inputs!I28)","v":""},{"$f":"IF(Inputs!J28=\"\",\"\",Inputs!J28)","v":""},{"$f":"IF(Inputs!$B13=\"\",\"\",Inputs!$B13)","v":1.5},{"$f":"IF(Method_BI=TRUE,IF('PB Liquefaction Initiation'!$F10=\"\",NA(),'PB Liquefaction Initiation'!$F10),NA())","v":33.874185446686866},{"$f":"IF(AND(Method_BI=TRUE,Inputs!J13=\"Yes\"),'PB Liquefaction Initiation'!S10,NA())","v":19.147705078125},{"$f":"IF(Method_BI=TRUE,IF('PB Liquefaction Initiation'!P10=\"\",\"\",'PB Liquefaction Initiation'!P10),NA())","v":0.22311236023806372},{"$f":"IF(Method_BI=TRUE,IF(Option_PL_FSL=\"FSL\",'PB Liquefaction Initiation'!R10,IF(Option_PL_FSL=\"PL\",'PB Liquefaction Initiation'!T10,NA())),NA())","v":4.531038012233954},{"$f":"IF(AND(Method_BI=TRUE,J26<>\"\"),IF(units=1,'PB Settlement'!AI8,CONVERT('PB Settlement'!AI8,\"cm\",\"in\")),NA())","v":16.277305971866863},{"$f":"IF(Method_Cetin=TRUE,'PB Liquefaction Initiation'!$D43,NA())","v":32.632000000000005},{"$f":"IF(Method_Cetin=TRUE,'PB Liquefaction Initiation'!J43,NA())","v":42.004928699970996},{"$f":"IF(Method_Cetin=TRUE,'PB Liquefaction Initiation'!M43,NA())","v":2.6853170884224604},{"$f":"IF(Method_Cetin=TRUE,IF(Option_PL_FSL=\"FSL\",'PB Liquefaction Initiation'!K43,IF(Option_PL_FSL=\"PL\",'PB Liquefaction Initiation'!L43,NA())),NA())","v":0.5067739356819696},{"$f":"IF(AND(Method_Cetin=TRUE,'Final Summary'!J26<>\"\"),IF(units=1,'PB Settlement'!AI36,CONVERT('PB Settlement'!AI36,\"cm\",\"in\")),NA())","v":16.936606037436931},{"$f":"IF(Inputs!$B13=\"\",\"\",Inputs!$B13)","v":1.5},{"$f":"IF(Method_BI=TRUE,IF('PB Liquefaction Initiation'!$F10=\"\",NA(),'PB Liquefaction Initiation'!$F10),NA())","v":33.874185446686866},{"$f":"IF(Method_BI=TRUE,IF(Inputs!J13=\"No\",NA(),'Det Liquefaction Initiation'!P10),NA())","v":30.872833251953125},{"$f":"IF(Method_BI=TRUE,'Det Liquefaction Initiation'!S10,NA())","v":0.41396383811397325},{"$f":"IF(Method_BI=TRUE,IF(Option_PL_FSL=\"FSL\",'Det Liquefaction Initiation'!Q10,'Det Liquefaction Initiation'!R10),NA())","v":1.8540697745700523},{"$f":"IF(Det_Liq_Option=FALSE,NA(),IF(AND(Method_BI=TRUE,U26<>\"\"),IF(units=1,'Det Settlement'!U7,CONVERT('Det Settlement'!U7,\"cm\",\"in\")),NA()))","v":12.880173220636962},{"$f":"IF(Method_Cetin=TRUE,'PB Liquefaction Initiation'!$D43,NA())","v":32.632000000000005},{"$f":"IF(Method_Cetin=TRUE,'Det Liquefaction Initiation'!K43,NA())","v":32.02838398000322},{"$f":"IF(Method_Cetin=TRUE,'Det Liquefaction Initiation'!N43,NA())","v":0.95265995669352044},{"$f":"IF(Method_Cetin=TRUE,IF(Option_PL_FSL=\"FSL\",'Det Liquefaction Initiation'!L43,'Det Liquefaction Initiation'!M43),NA())","v":1.6810605542142403},{"$f":"IF(Det_Liq_Option=FALSE,NA(),IF(AND(Method_Cetin=TRUE,'Final Summary'!U26<>\"\"),IF(units=1,'Det Settlement'!U33,CONVERT('Det Settlement'!U33,\"cm\",\"in\")),NA()))","v":17.781121844546966},null,"Input Parameters",null,"Refence Value",null,null,"Inputs for Deterministic Analysis"]
[{"$f":"IF(Inputs!B29=\"\",\"\",Inputs!B29)","v":""},{"$f":"IF(Inputs!C29=\"\",\"\",Inputs!C29)","v":""},{"$f":"IF(Inputs!D29=\"\",\"\",IF(Inputs!D29=\"Standard SS (2-in OD)\",\"Standard\",IF(Inputs!D29=\"Non-Standard (3-in OD)\", \"3-in OD\",IF(Inputs!D29=\"Non-Standard (2.5-in OD)\",\"2.5-in OD\",IF(Inputs!D29=\"D&M SS (3.25-in OD)\",\"3.25-in OD\",\"Custom\")))))","v":""},{"$f":"IF(Inputs!E29=\"\",\"\",Inputs!E29)","v":""},{"$f":"IF(Inputs!F29=\"\",\"\",Inputs!F29)","v":""},{"$f":"IF(Inputs!G29=\"\",\"\",Inputs!G29)","v":""},{"$f":"IF(Inputs!H29=\"\",\"\",Inputs!H29)","v":""},{"$f":"IF(Inputs!I29=\"\",\"\",Inputs!I29)","v":""},{"$f":"IF(Inputs!J29=\"\",\"\",Inputs!J29)","v":""},{"$f":"IF(Inputs!$B14=\"\",\"\",Inputs!$B14)","v":5.5},{"$f":"IF(Method_BI=TRUE,IF('PB Liquefaction Initiation'!$F11=\"\",NA(),'PB Liquefaction Initiation'!$F11),NA())","v":11.900438780020192},{"$f":"IF(AND(Method_BI=TRUE,Inputs!J14=\"Yes\"),'PB Liquefaction Initiation'!S11,NA())","v":27.375556945800781},{"$f":"IF(Method_BI=TRUE,IF('PB Liquefaction Initiation'!P11=\"\",\"\",'PB Liquefaction Initiation'!P11),NA())","v":0.40952183783721907},{"$f":"IF(Method_BI=TRUE,IF(Option_PL_FSL=\"FSL\",'PB Liquefaction Initiation'!R11,IF(Option_PL_FSL=\"PL\",'PB Liquefaction Initiation'!T11,NA())),NA())","v":0.36628433612858424},{"$f":"IF(AND(Method_BI=TRUE,J27<>\"\"),IF(units=1,'PB Settlement'!AI9,CONVERT('PB Settlement'!AI9,\"cm\",\"in\")),NA())","v":16.277305971866863},{"$f":"IF(Method_Cetin=TRUE,'PB Liquefaction Initiation'!$D44,NA())","v":10.621491593382261},{"$f":"IF(Method_Cetin=TRUE,'PB Liquefaction Initiation'!J44,NA())","v":46.832199771351362},{"$f":"IF(Method_Cetin=TRUE,'PB Liquefaction Initiation'!M44,NA())","v":2.6589660085161717},{"$f":"IF(Method_Cetin=TRUE,IF(Option_PL_FSL=\"FSL\",'PB Liquefaction Initiation'!K44,IF(Option_PL_FSL=\"PL\",'PB Liquefaction Initiation'!L44,NA())),NA())","v":7.2376967184628785E-2},{"$f":"IF(AND(Method_Cetin=TRUE,'Final Summary'!J27<>\"\"),IF(units=1,'PB Settlement'!AI37,CONVERT('PB Settlement'!AI37,\"cm\",\"in\")),NA())","v":16.199166662370263},{"$f":"IF(Inputs!$B14=\"\",\"\",Inputs!$B14)","v":5.5},{"$f":"IF(Method_BI=TRUE,IF('PB Liquefaction Initiation'!$F11=\"\",NA(),'PB Liquefaction Initiation'!$F11),NA())","v":11.900438780020192},{"$f":"IF(Method_BI=TRUE,IF(Inputs!J14=\"No\",NA(),'Det Liquefaction Initiation'!P11),NA())","v":34.456560134887695},{"$f":"IF(Method_BI=TRUE,'Det Liquefaction Initiation'!S11,NA())","v":0.75372797671486647},{"$f":"IF(Method_BI=TRUE,IF(Option_PL_FSL=\"FSL\",'Det Liquefaction Initiation'!Q11,'Det Liquefaction Initiation'!R11),NA())","v":0.15109424382340919},{"$f":"IF(Det_Liq_Option=FALSE,NA(),IF(AND(Method_BI=TRUE,U27<>\"\"),IF(units=1,'Det Settlement'!U8,CONVERT('Det Settlement'!U8,\"cm\",\"in\")),NA()))","v":12.846480018254567},{"$f":"IF(Method_Cetin=TRUE,'PB Liquefaction Initiation'!$D44,NA())","v":10.621491593382261},{"$f":"IF(Method_Cetin=TRUE,'Det Liquefaction Initiation'!K44,NA())","v":36.955805633264397},{"$f":"IF(Method_Cetin=TRUE,'Det Liquefaction Initiation'!N44,NA())","v":0.9501872677197607},{"$f":"IF(Method_Cetin=TRUE,IF(Option_PL_FSL=\"FSL\",'Det Liquefaction Initiation'!L44,'Det Liquefaction Initiation'!M44),NA())","v":0.23835012409072004},{"$f":"IF(Det_Liq_Option=FALSE,NA(),IF(AND(Method_Cetin=TRUE,'Final Summary'!U27<>\"\"),IF(units=1,'Det Settlement'!U34,CONVERT('Det Settlement'!U34,\"cm\",\"in\")),NA()))","v":17.034341326775493},"PGA =",{"$f":"IF(PGA_prob=\"\",\"\",PGA_prob)","v":0.44},null,"DR&Sref =",{"$f":"IF(D_ref_RS=\"\",\"\",D_ref_RS)","v":2.4300000000000002},null,"PGA =",{"$f":"IF(PGA_det=\"\",\"\",PGA_det)","v":0.73}]
[{"$f":"IF(Inputs!B30=\"\",\"\",Inputs!B30)","v":""},{"$f":"IF(Inputs!C30=\"\",\"\",Inputs!C30)","v":""},{"$f":"IF(Inputs!D30=\"\",\"\",IF(Inputs!D30=\"Standard SS (2-in OD)\",\"Standard\",IF(Inputs!D30=\"Non-Standard (3-in OD)\", \"3-in OD\",IF(Inputs!D30=\"Non-Standard (2.5-in OD)\",\"2.5-in OD\",IF(Inputs!D30=\"D&M SS (3.25-in OD)\",\"3.25-in OD\",\"Custom\")))))","v":""},{"$f":"IF(Inputs!E30=\"\",\"\",Inputs!E30)","v":""},{"$f":"IF(Inputs!F30=\"\",\"\",Inputs!F30)","v":""},{"$f":"IF(Inputs!G30=\"\",\"\",Inputs!G30)","v":""},{"$f":"IF(Inputs!H30=\"\",\"\",Inputs!H30)","v":""},{"$f":"IF(Inputs!I30=\"\",\"\",Inputs!I30)","v":""},{"$f":"IF(Inputs!J30=\"\",\"\",Inputs!J30)","v":""},{"$f":"IF(Inputs!$B15=\"\",\"\",Inputs!$B15)","v":10.5},{"$f":"IF(Method_BI=TRUE,IF('PB Liquefaction Initiation'!$F12=\"\",NA(),'PB Liquefaction Initiation'!$F12),NA())","v":13.693403668256009},{"$f":"IF(AND(Method_BI=TRUE,Inputs!J15=\"Yes\"),'PB Liquefaction Initiation'!S12,NA())","v":27.535186767578125},{"$f":"IF(Method_BI=TRUE,IF('PB Liquefaction Initiation'!P12=\"\",\"\",'PB Liquefaction Initiation'!P12),NA())","v":0.4161886272075469},{"$f":"IF(Method_BI=TRUE,IF(Option_PL_FSL=\"FSL\",'PB Liquefaction Initiation'!R12,IF(Option_PL_FSL=\"PL\",'PB Liquefaction Initiation'!T12,NA())),NA())","v":0.39800901685415463},{"$f":"IF(AND(Method_BI=TRUE,J28<>\"\"),IF(units=1,'PB Settlement'!AI10,CONVERT('PB Settlement'!AI10,\"cm\",\"in\")),NA())","v":12.157289531771442},{"$f":"IF(Method_Cetin=TRUE,'PB Liquefaction Initiation'!$D45,NA())","v":13.32533678800505},{"$f":"IF(Method_Cetin=TRUE,'PB Liquefaction Initiation'!J45,NA())","v":49.042805837838067},{"$f":"IF(Method_Cetin=TRUE,'PB Liquefaction Initiation'!M45,NA())","v":2.6093956450717322},{"$f":"IF(Method_Cetin=TRUE,IF(Option_PL_FSL=\"FSL\",'PB Liquefaction Initiation'!K45,IF(Option_PL_FSL=\"PL\",'PB Liquefaction Initiation'!L45,NA())),NA())","v":7.5012592581681872E-2},{"$f":"IF(AND(Method_Cetin=TRUE,'Final Summary'!J28<>\"\"),IF(units=1,'PB Settlement'!AI38,CONVERT('PB Settlement'!AI38,\"cm\",\"in\")),NA())","v":12.068266841666206},{"$f":"IF(Inputs!$B15=\"\",\"\",Inputs!$B15)","v":10.5},{"$f":"IF(Method_BI=TRUE,IF('PB Liquefaction Initiation'!$F12=\"\",NA(),'PB Liquefaction Initiation'!$F12),NA())","v":13.693403668256009},{"$f":"IF(Method_BI=TRUE,IF(Inputs!J15=\"No\",NA(),'Det Liquefaction Initiation'!P12),NA())","v":34.541889190673828},{"$f":"IF(Method_BI=TRUE,'Det Liquefaction Initiation'!S12,NA())","v":0.76658707737983955},{"$f":"IF(Method_BI=TRUE,IF(Option_PL_FSL=\"FSL\",'Det Liquefaction Initiation'!Q12,'Det Liquefaction Initiation'!R12),NA())","v":0.16405473453769903},{"$f":"IF(Det_Liq_Option=FALSE,NA(),IF(AND(Method_BI=TRUE,U28<>\"\"),IF(units=1,'Det Settlement'!U9,CONVERT('Det Settlement'!U9,\"cm\",\"in\")),NA()))","v":9.6472942084314806},{"$f":"IF(Method_Cetin=TRUE,'PB Liquefaction Initiation'!$D45,NA())","v":13.32533678800505},{"$f":"IF(Method_Cetin=TRUE,'Det Liquefaction Initiation'!K45,NA())","v":39.374718423613992},{"$f":"IF(Method_Cetin=TRUE,'Det Liquefaction Initiation'!N45,NA())","v":0.94666571539436606},{"$f":"IF(Method_Cetin=TRUE,IF(Option_PL_FSL=\"FSL\",'Det Liquefaction Initiation'!L45,'Det Liquefaction Initiation'!M45),NA())","v":0.24332620501597385},{"$f":"IF(Det_Liq_Option=FALSE,NA(),IF(AND(Method_Cetin=TRUE,'Final Summary'!U28<>\"\"),IF(units=1,'Det Settlement'!U35,CONVERT('Det Settlement'!U35,\"cm\",\"in\")),NA()))","v":12.83299742307605},"FPGA =",{"$f":"IF(Fpga=\"\",\"\",Fpga)","v":1.06},null,"DB&Tref =",{"$f":"IF(D_ref_BT=\"\",\"\",D_ref_BT)","v":2.65},null,"ky=",{"$f":"IF(ky_site=\"\",\"\",ky_site)","v":0.2}]
[{"$f":"IF(Inputs!B31=\"\",\"\",Inputs!B31)","v":""},{"$f":"IF(Inputs!C31=\"\",\"\",Inputs!C31)","v":""},{"$f":"IF(Inputs!D31=\"\",\"\",IF(Inputs!D31=\"Standard SS (2-in OD)\",\"Standard\",IF(Inputs!D31=\"Non-Standard (3-in OD)\", \"3-in OD\",IF(Inputs!D31=\"Non-Standard (2.5-in OD)\",\"2.5-in OD\",IF(Inputs!D31=\"D&M SS (3.25-in OD)\",\"3.25-in OD\",\"Custom\")))))","v":""},{"$f":"IF(Inputs!E31=\"\",\"\",Inputs!E31)","v":""},{"$f":"IF(Inputs!F31=\"\",\"\",Inputs!F31)","v":""},{"$f":"IF(Inputs!G31=\"\",\"\",Inputs!G31)","v":""},{"$f":"IF(Inputs!H31=\"\",\"\",Inputs!H31)","v":""},{"$f":"IF(Inputs!I31=\"\",\"\",Inputs!I31)","v":""},{"$f":"IF(Inputs!J31=\"\",\"\",Inputs!J31)","v":""},{"$f":"IF(Inputs!$B16=\"\",\"\",Inputs!$B16)","v":15},{"$f":"IF(Method_BI=TRUE,IF('PB Liquefaction Initiation'!$F13=\"\",NA(),'PB Liquefaction Initiation'!$F13),NA())","v":7.5891695726420965},{"$f":"IF(AND(Method_BI=TRUE,Inputs!J16=\"Yes\"),'PB Liquefaction Initiation'!S13,NA())","v":{"$error":"#N/A"}},{"$f":"IF(Method_BI=TRUE,IF('PB Liquefaction Initiation'!P13=\"\",\"\",'PB Liquefaction Initiation'!P13),NA())","v":{"$error":"#N/A"}},{"$f":"IF(Method_BI=TRUE,IF(Option_PL_FSL=\"FSL\",'PB Liquefaction Initiation'!R13,IF(Option_PL_FSL=\"PL\",'PB Liquefaction Initiation'!T13,NA())),NA())","v":{"$error":"#N/A"}},{"$f":"IF(AND(Method_BI=TRUE,J29<>\"\"),IF(units=1,'PB Settlement'!AI11,CONVERT('PB Settlement'!AI11,\"cm\",\"in\")),NA())","v":8.9436638958629757},{"$f":"IF(Method_Cetin=TRUE,'PB Liquefaction Initiation'!$D46,NA())","v":4.0320252341104634},{"$f":"IF(Method_Cetin=TRUE,'PB Liquefaction Initiation'!J46,NA())","v":{"$error":"#N/A"}},{"$f":"IF(Method_Cetin=TRUE,'PB Liquefaction Initiation'!M46,NA())","v":{"$error":"#N/A"}},{"$f":"IF(Method_Cetin=TRUE,IF(Option_PL_FSL=\"FSL\",'PB Liquefaction Initiation'!K46,IF(Option_PL_FSL=\"PL\",'PB Liquefaction Initiation'!L46,NA())),NA())","v":{"$error":"#N/A"}},{"$f":"IF(AND(Method_Cetin=TRUE,'Final Summary'!J29<>\"\"),IF(units=1,'PB Settlement'!AI39,CONVERT('PB Settlement'!AI39,\"cm\",\"in\")),NA())","v":8.7697142561281183},{"$f":"IF(Inputs!$B16=\"\",\"\",Inputs!$B16)","v":15},{"$f":"IF(Method_BI=TRUE,IF('PB Liquefaction Initiation'!$F13=\"\",NA(),'PB Liquefaction Initiation'!$F13),NA())","v":7.5891695726420965},{"$f":"IF(Method_BI=TRUE,IF(Inputs!J16=\"No\",NA(),'Det Liquefaction Initiation'!P13),NA())","v":{"$error":"#N/A"}},{"$f":"IF(Method_BI=TRUE,'Det Liquefaction Initiation'!S13,NA())","v":{"$error":"#N/A"}},{"$f":"IF(Method_BI=TRUE,IF(Option_PL_FSL=\"FSL\",'Det Liquefaction Initiation'!Q13,'Det Liquefaction Initiation'!R13),NA())","v":{"$error":"#N/A"}},{"$f":"IF(Det_Liq_Option=FALSE,NA(),IF(AND(Method_BI=TRUE,U29<>\"\"),IF(units=1,'Det Settlement'!U10,CONVERT('Det Settlement'!U10,\"cm\",\"in\")),NA()))","v":7.003131034746807},{"$f":"IF(Method_Cetin=TRUE,'PB Liquefaction Initiation'!$D46,NA())","v":4.0320252341104634},{"$f":"IF(Method_Cetin=TRUE,'Det Liquefaction Initiation'!K46,NA())","v":{"$error":"#N/A"}},{"$f":"IF(Method_Cetin=TRUE,'Det Liquefaction Initiation'!N46,NA())","v":{"$error":"#N/A"}},{"$f":"IF(Method_Cetin=TRUE,IF(Option_PL_FSL=\"FSL\",'Det Liquefaction Initiation'!L46,'Det Liquefaction Initiation'!M46),NA())","v":{"$error":"#N/A"}},{"$f":"IF(Det_Liq_Option=FALSE,NA(),IF(AND(Method_Cetin=TRUE,'Final Summary'!U29<>\"\"),IF(units=1,'Det Settlement'!U36,CONVERT('Det Settlement'!U36,\"cm\",\"in\")),NA()))","v":9.3918712355518235},"Mw =",{"$f":"IF(Mw_prob=\"\",\"\",Mw_prob)","v":6.77},null,null,null,null,"Mw =",{"$f":"IF(Mw_det=\"\",\"\",Mw_det)","v":6.8}]
[{"$f":"IF(Inputs!B32=\"\",\"\",Inputs!B32)","v":""},{"$f":"IF(Inputs!C32=\"\",\"\",Inputs!C32)","v":""},{"$f":"IF(Inputs!D32=\"\",\"\",IF(Inputs!D32=\"Standard SS (2-in OD)\",\"Standard\",IF(Inputs!D32=\"Non-Standard (3-in OD)\", \"3-in OD\",IF(Inputs!D32=\"Non-Standard (2.5-in OD)\",\"2.5-in OD\",IF(Inputs!D32=\"D&M SS (3.25-in OD)\",\"3.25-in OD\",\"Custom\")))))","v":""},{"$f":"IF(Inputs!E32=\"\",\"\",Inputs!E32)","v":""},{"$f":"IF(Inputs!F32=\"\",\"\",Inputs!F32)","v":""},{"$f":"IF(Inputs!G32=\"\",\"\",Inputs!G32)","v":""},{"$f":"IF(Inputs!H32=\"\",\"\",Inputs!H32)","v":""},{"$f":"IF(Inputs!I32=\"\",\"\",Inputs!I32)","v":""},{"$f":"IF(Inputs!J32=\"\",\"\",Inputs!J32)","v":""},{"$f":"IF(Inputs!$B17=\"\",\"\",Inputs!$B17)","v":20.5},{"$f":"IF(Method_BI=TRUE,IF('PB Liquefaction Initiation'!$F14=\"\",NA(),'PB Liquefaction Initiation'!$F14),NA())","v":21.708473911296679},{"$f":"IF(AND(Method_BI=TRUE,Inputs!J17=\"Yes\"),'PB Liquefaction Initiation'!S14,NA())","v":26.788627624511719},{"$f":"IF(Method_BI=TRUE,IF('PB Liquefaction Initiation'!P14=\"\",\"\",'PB Liquefaction Initiation'!P14),NA())","v":0.38666916463062412},{"$f":"IF(Method_BI=TRUE,IF(Option_PL_FSL=\"FSL\",'PB Liquefaction Initiation'!R14,IF(Option_PL_FSL=\"PL\",'PB Liquefaction Initiation'!T14,NA())),NA())","v":0.67349663088987843},{"$f":"IF(AND(Method_BI=TRUE,J30<>\"\"),IF(units=1,'PB Settlement'!AI12,CONVERT('PB Settlement'!AI12,\"cm\",\"in\")),NA())","v":8.9436638958629757},{"$f":"IF(Method_Cetin=TRUE,'PB Liquefaction Initiation'!$D47,NA())","v":22.247219944730496},{"$f":"IF(Method_Cetin=TRUE,'PB Liquefaction Initiation'!J47,NA())","v":50.606475950225416},{"$f":"IF(Method_Cetin=TRUE,'PB Liquefaction Initiation'!M47,NA())","v":2.4282607055619039},{"$f":"IF(Method_Cetin=TRUE,IF(Option_PL_FSL=\"FSL\",'PB Liquefaction Initiation'!K47,IF(Option_PL_FSL=\"PL\",'PB Liquefaction Initiation'!L47,NA())),NA())","v":0.12789971804790864},{"$f":"IF(AND(Method_Cetin=TRUE,'Final Summary'!J30<>\"\"),IF(units=1,'PB Settlement'!AI40,CONVERT('PB Settlement'!AI40,\"cm\",\"in\")),NA())","v":8.7697142561281183},{"$f":"IF(Inputs!$B17=\"\",\"\",Inputs!$B17)","v":20.5},{"$f":"IF(Method_BI=TRUE,IF('PB Liquefaction Initiation'!$F14=\"\",NA(),'PB Liquefaction Initiation'!$F14),NA())","v":21.708473911296679},{"$f":"IF(Method_BI=TRUE,IF(Inputs!J17=\"No\",NA(),'Det Liquefaction Initiation'!P14),NA())","v":34.183750152587891},{"$f":"IF(Method_BI=TRUE,'Det Liquefaction Initiation'!S14,NA())","v":0.71468998628801128},{"$f":"IF(Method_BI=TRUE,IF(Option_PL_FSL=\"FSL\",'Det Liquefaction Initiation'!Q14,'Det Liquefaction Initiation'!R14),NA())","v":0.27664601158220065},{"$f":"IF(Det_Liq_Option=FALSE,NA(),IF(AND(Method_BI=TRUE,U30<>\"\"),IF(units=1,'Det Settlement'!U11,CONVERT('Det Settlement'!U11,\"cm\",\"in\")),NA()))","v":7.003131034746807},{"$f":"IF(Method_Cetin=TRUE,'PB Liquefaction Initiation'!$D47,NA())","v":22.247219944730496},{"$f":"IF(Method_Cetin=TRUE,'Det Liquefaction Initiation'!K47,NA())","v":41.802703817817168},{"$f":"IF(Method_Cetin=TRUE,'Det Liquefaction Initiation'!N47,NA())","v":0.93793401402117049},{"$f":"IF(Method_Cetin=TRUE,IF(Option_PL_FSL=\"FSL\",'Det Liquefaction Initiation'!L47,'Det Liquefaction Initiation'!M47),NA())","v":0.38967633874842733},{"$f":"IF(Det_Liq_Option=FALSE,NA(),IF(AND(Method_Cetin=TRUE,'Final Summary'!U30<>\"\"),IF(units=1,'Det Settlement'!U37,CONVERT('Det Settlement'!U37,\"cm\",\"in\")),NA()))","v":9.3918712355518235},"ky=",{"$f":"IF(ky_site=\"\",\"\",ky_site)","v":0.2},null,null,null,null,"Percentile =",{"$f":"IF(Percentile_Slope=\"\",\"\",Percentile_Slope)","v":85}]
[null,null,null,null,null,null,null,null,null,{"$f":"IF(Inputs!$B18=\"\",\"\",Inputs!$B18)","v":25.5},{"$f":"IF(Method_BI=TRUE,IF('PB Liquefaction Initiation'!$F15=\"\",NA(),'PB Liquefaction Initiation'!$F15),NA())","v":29.14039966028972},{"$f":"IF(AND(Method_BI=TRUE,Inputs!J18=\"Yes\"),'PB Liquefaction Initiation'!S15,NA())","v":25.683929443359375},{"$f":"IF(Method_BI=TRUE,IF('PB Liquefaction Initiation'!P15=\"\",\"\",'PB Liquefaction Initiation'!P15),NA())","v":0.34978821385211095},{"$f":"IF(Method_BI=TRUE,IF(Option_PL_FSL=\"FSL\",'PB Liquefaction Initiation'!R15,IF(Option_PL_FSL=\"PL\",'PB Liquefaction Initiation'!T15,NA())),NA())","v":1.4196896207753118},{"$f":"IF(AND(Method_BI=TRUE,J31<>\"\"),IF(units=1,'PB Settlement'!AI13,CONVERT('PB Settlement'!AI13,\"cm\",\"in\")),NA())","v":7.0901023156942484},{"$f":"IF(Method_Cetin=TRUE,'PB Liquefaction Initiation'!$D48,NA())","v":30.426482551232123},{"$f":"IF(Method_Cetin=TRUE,'PB Liquefaction Initiation'!J48,NA())","v":50.629335939451124},{"$f":"IF(Method_Cetin=TRUE,'PB Liquefaction Initiation'!M48,NA())","v":2.2895929161369906},{"$f":"IF(Method_Cetin=TRUE,IF(Option_PL_FSL=\"FSL\",'PB Liquefaction Initiation'!K48,IF(Option_PL_FSL=\"PL\",'PB Liquefaction Initiation'!L48,NA())),NA())","v":0.23106955639281196},{"$f":"IF(AND(Method_Cetin=TRUE,'Final Summary'!J31<>\"\"),IF(units=1,'PB Settlement'!AI41,CONVERT('PB Settlement'!AI41,\"cm\",\"in\")),NA())","v":6.3247629613227909},{"$f":"IF(Inputs!$B18=\"\",\"\",Inputs!$B18)","v":25.5},{"$f":"IF(Method_BI=TRUE,IF('PB Liquefaction Initiation'!$F15=\"\",NA(),'PB Liquefaction Initiation'!$F15),NA())","v":29.14039966028972},{"$f":"IF(Method_BI=TRUE,IF(Inputs!J18=\"No\",NA(),'Det Liquefaction Initiation'!P15),NA())","v":33.668972015380859},{"$f":"IF(Method_BI=TRUE,'Det Liquefaction Initiation'!S15,NA())","v":0.64883549021389109},{"$f":"IF(Method_BI=TRUE,IF(Option_PL_FSL=\"FSL\",'Det Liquefaction Initiation'!Q15,'Det Liquefaction Initiation'!R15),NA())","v":0.58107357361902523},{"$f":"IF(Det_Liq_Option=FALSE,NA(),IF(AND(Method_BI=TRUE,U31<>\"\"),IF(units=1,'Det Settlement'!U12,CONVERT('Det Settlement'!U12,\"cm\",\"in\")),NA()))","v":4.939580636283611},{"$f":"IF(Method_Cetin=TRUE,'PB Liquefaction Initiation'!$D48,NA())","v":30.426482551232123},{"$f":"IF(Method_Cetin=TRUE,'Det Liquefaction Initiation'!K48,NA())","v":42.55745264001893},{"$f":"IF(Method_Cetin=TRUE,'Det Liquefaction Initiation'!N48,NA())","v":0.93257751573693215},{"$f":"IF(Method_Cetin=TRUE,IF(Option_PL_FSL=\"FSL\",'Det Liquefaction Initiation'!L48,'Det Liquefaction Initiation'!M48),NA())","v":0.6676171516200663},{"$f":"IF(Det_Liq_Option=FALSE,NA(),IF(AND(Method_Cetin=TRUE,'Final Summary'!U31<>\"\"),IF(units=1,'Det Settlement'!U38,CONVERT('Det Settlement'!U38,\"cm\",\"in\")),NA()))","v":6.6722732408434187},"Site Class =",{"$f":"IF(Class=\"\",\"\",Class)","v":"D"}]
["Site Liquefaction Parameters:",null,null,null,null,"Mapped Reference Values:",null,null,null,{"$f":"IF(Inputs!$B19=\"\",\"\",Inputs!$B19)","v":30.5},{"$f":"IF(Method_BI=TRUE,IF('PB Liquefaction Initiation'!$F16=\"\",NA(),'PB Liquefaction Initiation'!$F16),NA())","v":21.337630575889257},{"$f":"IF(AND(Method_BI=TRUE,Inputs!J19=\"Yes\"),'PB Liquefaction Initiation'!S16,NA())","v":26.725074768066406},{"$f":"IF(Method_BI=TRUE,IF('PB Liquefaction Initiation'!P16=\"\",\"\",'PB Liquefaction Initiation'!P16),NA())","v":0.38434246369067387},{"$f":"IF(Method_BI=TRUE,IF(Option_PL_FSL=\"FSL\",'PB Liquefaction Initiation'!R16,IF(Option_PL_FSL=\"PL\",'PB Liquefaction Initiation'!T16,NA())),NA())","v":0.66174912583443657},{"$f":"IF(AND(Method_BI=TRUE,J32<>\"\"),IF(units=1,'PB Settlement'!AI14,CONVERT('PB Settlement'!AI14,\"cm\",\"in\")),NA())","v":7.0901023156942484},{"$f":"IF(Method_Cetin=TRUE,'PB Liquefaction Initiation'!$D49,NA())","v":20.884133717749325},{"$f":"IF(Method_Cetin=TRUE,'PB Liquefaction Initiation'!J49,NA())","v":50.3009279074316},{"$f":"IF(Method_Cetin=TRUE,'PB Liquefaction Initiation'!M49,NA())","v":2.1275275435569823},{"$f":"IF(Method_Cetin=TRUE,IF(Option_PL_FSL=\"FSL\",'PB Liquefaction Initiation'!K49,IF(Option_PL_FSL=\"PL\",'PB Liquefaction Initiation'!L49,NA())),NA())","v":0.11845791274525296},{"$f":"IF(AND(Method_Cetin=TRUE,'Final Summary'!J32<>\"\"),IF(units=1,'PB Settlement'!AI42,CONVERT('PB Settlement'!AI42,\"cm\",\"in\")),NA())","v":5.6842877773395797},{"$f":"IF(Inputs!$B19=\"\",\"\",Inputs!$B19)","v":30.5},{"$f":"IF(Method_BI=TRUE,IF('PB Liquefaction Initiation'!$F16=\"\",NA(),'PB Liquefaction Initiation'!$F16),NA())","v":21.337630575889257},{"$f":"IF(Method_BI=TRUE,IF(Inputs!J19=\"No\",NA(),'Det Liquefaction Initiation'!P16),NA())","v":34.15599250793457},{"$f":"IF(Method_BI=TRUE,'Det Liquefaction Initiation'!S16,NA())","v":0.71089441090745842},{"$f":"IF(Method_BI=TRUE,IF(Option_PL_FSL=\"FSL\",'Det Liquefaction Initiation'!Q16,'Det Liquefaction Initiation'!R16),NA())","v":0.27162753281988083},{"$f":"IF(Det_Liq_Option=FALSE,NA(),IF(AND(Method_BI=TRUE,U32<>\"\"),IF(units=1,'Det Settlement'!U13,CONVERT('Det Settlement'!U13,\"cm\",\"in\")),NA()))","v":4.5567096438495707},{"$f":"IF(Method_Cetin=TRUE,'PB Liquefaction Initiation'!$D49,NA())","v":20.884133717749325},{"$f":"IF(Method_Cetin=TRUE,'Det Liquefaction Initiation'!K49,NA())","v":43.150591476199544},{"$f":"IF(Method_Cetin=TRUE,'Det Liquefaction Initiation'!N49,NA())","v":0.92645544117795442},{"$f":"IF(Method_Cetin=TRUE,IF(Option_PL_FSL=\"FSL\",'Det Liquefaction Initiation'!L49,'Det Liquefaction Initiation'!M49),NA())","v":0.32012983712466553},{"$f":"IF(Det_Liq_Option=FALSE,NA(),IF(AND(Method_Cetin=TRUE,'Final Summary'!U32<>\"\"),IF(units=1,'Det Settlement'!U39,CONVERT('Det Settlement'!U39,\"cm\",\"in\")),NA()))","v":5.9265968427560916}]
[null,null,null,null,null,null,null,null,null,{"$f":"IF(Inputs!$B20=\"\",\"\",Inputs!$B20)","v":35.5},{"$f":"IF(Method_BI=TRUE,IF('PB Liquefaction Initiation'!$F17=\"\",NA(),'PB Liquefaction Initiation'!$F17),NA())","v":9.4876390112066709},{"$f":"IF(AND(Method_BI=TRUE,Inputs!J20=\"Yes\"),'PB Liquefaction Initiation'!S17,NA())","v":27.469764709472656},{"$f":"IF(Method_BI=TRUE,IF('PB Liquefaction Initiation'!P17=\"\",\"\",'PB Liquefaction Initiation'!P17),NA())","v":0.41343030456417246},{"$f":"IF(Method_BI=TRUE,IF(Option_PL_FSL=\"FSL\",'PB Liquefaction Initiation'!R17,IF(Option_PL_FSL=\"PL\",'PB Liquefaction Initiation'!T17,NA())),NA())","v":0.31547101888912921},{"$f":"IF(AND(Method_BI=TRUE,J33<>\"\"),IF(units=1,'PB Settlement'!AI15,CONVERT('PB Settlement'!AI15,\"cm\",\"in\")),NA())","v":5.6686338423258835},{"$f":"IF(Method_Cetin=TRUE,'PB Liquefaction Initiation'!$D50,NA())","v":9.1514758932516074},{"$f":"IF(Method_Cetin=TRUE,'PB Liquefaction Initiation'!J50,NA())","v":49.75511132234022},{"$f":"IF(Method_Cetin=TRUE,'PB Liquefaction Initiation'!M50,NA())","v":1.9607514306875602},{"$f":"IF(Method_Cetin=TRUE,IF(Option_PL_FSL=\"FSL\",'PB Liquefaction Initiation'!K50,IF(Option_PL_FSL=\"PL\",'PB Liquefaction Initiation'!L50,NA())),NA())","v":5.2632258672442339E-2},{"$f":"IF(AND(Method_Cetin=TRUE,'Final Summary'!J33<>\"\"),IF(units=1,'PB Settlement'!AI43,CONVERT('PB Settlement'!AI43,\"cm\",\"in\")),NA())","v":3.7703095798413702},{"$f":"IF(Inputs!$B20=\"\",\"\",Inputs!$B20)","v":35.5},{"$f":"IF(Method_BI=TRUE,IF('PB Liquefaction Initiation'!$F17=\"\",NA(),'PB Liquefaction Initiation'!$F17),NA())","v":9.4876390112066709},{"$f":"IF(Method_BI=TRUE,IF(Inputs!J20=\"No\",NA(),'Det Liquefaction Initiation'!P17),NA())","v":34.513477325439453},{"$f":"IF(Method_BI=TRUE,'Det Liquefaction Initiation'!S17,NA())","v":0.76226618833284232},{"$f":"IF(Method_BI=TRUE,IF(Option_PL_FSL=\"FSL\",'Det Liquefaction Initiation'!Q17,'Det Liquefaction Initiation'!R17),NA())","v":0.12990392170651952},{"$f":"IF(Det_Liq_Option=FALSE,NA(),IF(AND(Method_BI=TRUE,U33<>\"\"),IF(units=1,'Det Settlement'!U14,CONVERT('Det Settlement'!U14,\"cm\",\"in\")),NA()))","v":3.0056729797070396},{"$f":"IF(Method_Cetin=TRUE,'PB Liquefaction Initiation'!$D50,NA())","v":9.1514758932516074},{"$f":"IF(Method_Cetin=TRUE,'Det Liquefaction Initiation'!K50,NA())","v":43.626351273603085},{"$f":"IF(Method_Cetin=TRUE,'Det Liquefaction Initiation'!N50,NA())","v":0.91948539635050286},{"$f":"IF(Method_Cetin=TRUE,IF(Option_PL_FSL=\"FSL\",'Det Liquefaction Initiation'!L50,'Det Liquefaction Initiation'!M50),NA())","v":0.13208123927108129},{"$f":"IF(Det_Liq_Option=FALSE,NA(),IF(AND(Method_Cetin=TRUE,'Final Summary'!U33<>\"\"),IF(units=1,'Det Settlement'!U40,CONVERT('Det Settlement'!U40,\"cm\",\"in\")),NA()))","v":3.7460448751286823}]
["PGA =",{"$f":"IF(PGA_prob=\"\",\"\",PGA_prob)","v":0.44},null,null,null,"CSR(%)ref =",{"$f":"IF(CSR_ref_BI=\"\",\"\",CSR_ref_BI)","v":35.14},null,null,{"$f":"IF(Inputs!$B21=\"\",\"\",Inputs!$B21)","v":41},{"$f":"IF(Method_BI=TRUE,IF('PB Liquefaction Initiation'!$F18=\"\",NA(),'PB Liquefaction Initiation'!$F18),NA())","v":7.3030476983682764},{"$f":"IF(AND(Method_BI=TRUE,Inputs!J21=\"Yes\"),'PB Liquefaction Initiation'!S18,NA())","v":{"$error":"#N/A"}},{"$f":"IF(Method_BI=TRUE,IF('PB Liquefaction Initiation'!P18=\"\",\"\",'PB Liquefaction Initiation'!P18),NA())","v":{"$error":"#N/A"}},{"$f":"IF(Method_BI=TRUE,IF(Option_PL_FSL=\"FSL\",'PB Liquefaction Initiation'!R18,IF(Option_PL_FSL=\"PL\",'PB Liquefaction Initiation'!T18,NA())),NA())","v":{"$error":"#N/A"}},{"$f":"IF(AND(Method_BI=TRUE,J34<>\"\"),IF(units=1,'PB Settlement'!AI16,CONVERT('PB Settlement'!AI16,\"cm\",\"in\")),NA())","v":4.3024633872849156},{"$f":"IF(Method_Cetin=TRUE,'PB Liquefaction Initiation'!$D51,NA())","v":4.144728715335928},{"$f":"IF(Method_Cetin=TRUE,'PB Liquefaction Initiation'!J51,NA())","v":{"$error":"#N/A"}},{"$f":"IF(Method_Cetin=TRUE,'PB Liquefaction Initiation'!M51,NA())","v":{"$error":"#N/A"}},{"$f":"IF(Method_Cetin=TRUE,IF(Option_PL_FSL=\"FSL\",'PB Liquefaction Initiation'!K51,IF(Option_PL_FSL=\"PL\",'PB Liquefaction Initiation'!L51,NA())),NA())","v":{"$error":"#N/A"}},{"$f":"IF(AND(Method_Cetin=TRUE,'Final Summary'!J34<>\"\"),IF(units=1,'PB Settlement'!AI44,CONVERT('PB Settlement'!AI44,\"cm\",\"in\")),NA())","v":2.5314924169812505},{"$f":"IF(Inputs!$B21=\"\",\"\",Inputs!$B21)","v":41},{"$f":"IF(Method_BI=TRUE,IF('PB Liquefaction Initiation'!$F18=\"\",NA(),'PB Liquefaction Initiation'!$F18),NA())","v":7.3030476983682764},{"$f":"IF(Method_BI=TRUE,IF(Inputs!J21=\"No\",NA(),'Det Liquefaction Initiation'!P18),NA())","v":{"$error":"#N/A"}},{"$f":"IF(Method_BI=TRUE,'Det Liquefaction Initiation'!S18,NA())","v":{"$error":"#N/A"}},{"$f":"IF(Method_BI=TRUE,IF(Option_PL_FSL=\"FSL\",'Det Liquefaction Initiation'!Q18,'Det Liquefaction Initiation'!R18),NA())","v":{"$error":"#N/A"}},{"$f":"IF(Det_Liq_Option=FALSE,NA(),IF(AND(Method_BI=TRUE,U34<>\"\"),IF(units=1,'Det Settlement'!U15,CONVERT('Det Settlement'!U15,\"cm\",\"in\")),NA()))","v":2.0380879537433767},{"$f":"IF(Method_Cetin=TRUE,'PB Liquefaction Initiation'!$D51,NA())","v":4.144728715335928},{"$f":"IF(Method_Cetin=TRUE,'Det Liquefaction Initiation'!K51,NA())","v":{"$error":"#N/A"}},{"$f":"IF(Method_Cetin=TRUE,'Det Liquefaction Initiation'!N51,NA())","v":{"$error":"#N/A"}},{"$f":"IF(Method_Cetin=TRUE,IF(Option_PL_FSL=\"FSL\",'Det Liquefaction Initiation'!L51,'Det Liquefaction Initiation'!M51),NA())","v":{"$error":"#N/A"}},{"$f":"IF(Det_Liq_Option=FALSE,NA(),IF(AND(Method_Cetin=TRUE,'Final Summary'!U34<>\"\"),IF(units=1,'Det Settlement'!U41,CONVERT('Det Settlement'!U41,\"cm\",\"in\")),NA()))","v":2.4524575293648705},"Seismic Slope Displacement Results:"]
["FPGA =",{"$f":"IF(Fpga=\"\",\"\",Fpga)","v":1.06},null,null,null,"Nreqref =",{"$f":"IF(Nreq_ref_Cet=\"\",\"\",Nreq_ref_Cet)","v":49.09},null,null,{"$f":"IF(Inputs!$B22=\"\",\"\",Inputs!$B22)","v":45},{"$f":"IF(Method_BI=TRUE,IF('PB Liquefaction Initiation'!$F19=\"\",NA(),'PB Liquefaction Initiation'!$F19),NA())","v":1.6327566637818389},{"$f":"IF(AND(Method_BI=TRUE,Inputs!J22=\"Yes\"),'PB Liquefaction Initiation'!S19,NA())","v":27.121719360351563},{"$f":"IF(Method_BI=TRUE,IF('PB Liquefaction Initiation'!P19=\"\",\"\",'PB Liquefaction Initiation'!P19),NA())","v":0.3993356758905604},{"$f":"IF(Method_BI=TRUE,IF(Option_PL_FSL=\"FSL\",'PB Liquefaction Initiation'!R19,IF(Option_PL_FSL=\"PL\",'PB Liquefaction Initiation'!T19,NA())),NA())","v":0.19468062364165611},{"$f":"IF(AND(Method_BI=TRUE,J35<>\"\"),IF(units=1,'PB Settlement'!AI17,CONVERT('PB Settlement'!AI17,\"cm\",\"in\")),NA())","v":4.3024633872849156},{"$f":"IF(Method_Cetin=TRUE,'PB Liquefaction Initiation'!$D52,NA())","v":2.0632593460236448},{"$f":"IF(Method_Cetin=TRUE,'PB Liquefaction Initiation'!J52,NA())","v":48.692972152870666},{"$f":"IF(Method_Cetin=TRUE,'PB Liquefaction Initiation'!M52,NA())","v":1.6999817010556288},{"$f":"IF(Method_Cetin=TRUE,IF(Option_PL_FSL=\"FSL\",'PB Liquefaction Initiation'!K52,IF(Option_PL_FSL=\"PL\",'PB Liquefaction Initiation'!L52,NA())),NA())","v":3.399931176180504E-2},{"$f":"IF(AND(Method_Cetin=TRUE,'Final Summary'!J35<>\"\"),IF(units=1,'PB Settlement'!AI45,CONVERT('PB Settlement'!AI45,\"cm\",\"in\")),NA())","v":2.5314924169812505},{"$f":"IF(Inputs!$B22=\"\",\"\",Inputs!$B22)","v":45},{"$f":"IF(Method_BI=TRUE,IF('PB Liquefaction Initiation'!$F19=\"\",NA(),'PB Liquefaction Initiation'!$F19),NA())","v":1.6327566637818389},{"$f":"IF(Method_BI=TRUE,IF(Inputs!J22=\"No\",NA(),'Det Liquefaction Initiation'!P19),NA())","v":34.336931228637695},{"$f":"IF(Method_BI=TRUE,'Det Liquefaction Initiation'!S19,NA())","v":0.73623162212844251},{"$f":"IF(Method_BI=TRUE,IF(Option_PL_FSL=\"FSL\",'Det Liquefaction Initiation'!Q19,'Det Liquefaction Initiation'!R19),NA())","v":8.0170301250297227E-2},{"$f":"IF(Det_Liq_Option=FALSE,NA(),IF(AND(Method_BI=TRUE,U35<>\"\"),IF(units=1,'Det Settlement'!U16,CONVERT('Det Settlement'!U16,\"cm\",\"in\")),NA()))","v":2.0380879537433767},{"$f":"IF(Method_Cetin=TRUE,'PB Liquefaction Initiation'!$D52,NA())","v":2.0632593460236448},{"$f":"IF(Method_Cetin=TRUE,'Det Liquefaction Initiation'!K52,NA())","v":44.292057499753916},{"$f":"IF(Method_Cetin=TRUE,'Det Liquefaction Initiation'!N52,NA())","v":0.90361270859979537},{"$f":"IF(Method_Cetin=TRUE,IF(Option_PL_FSL=\"FSL\",'Det Liquefaction Initiation'!L52,'Det Liquefaction Initiation'!M52),NA())","v":7.5273734828321059E-2},{"$f":"IF(Det_Liq_Option=FALSE,NA(),IF(AND(Method_Cetin=TRUE,'Final Summary'!U35<>\"\"),IF(units=1,'Det Settlement'!U42,CONVERT('Det Settlement'!U42,\"cm\",\"in\")),NA()))","v":2.4524575293648705}]
["Mw =",{"$f":"IF(Mw_prob=\"\",\"\",Mw_prob)","v":6.77},null,null,null,"εv,Cetin(%)ref =",{"$f":"IF(strain_ref_cetin=\"\",\"\",strain_ref_cetin)","v":2.2999999999999998},null,null,{"$f":"IF(Inputs!$B23=\"\",\"\",Inputs!$B23)","v":51.5},{"$f":"IF(Method_BI=TRUE,IF('PB Liquefaction Initiation'!$F20=\"\",NA(),'PB Liquefaction Initiation'!$F20),NA())","v":9.6599215676559655},{"$f":"IF(AND(Method_BI=TRUE,Inputs!J23=\"Yes\"),'PB Liquefaction Initiation'!S20,NA())","v":26.560958862304688},{"$f":"IF(Method_BI=TRUE,IF('PB Liquefaction Initiation'!P20=\"\",\"\",'PB Liquefaction Initiation'!P20),NA())","v":0.37845267566951402},{"$f":"IF(Method_BI=TRUE,IF(Option_PL_FSL=\"FSL\",'PB Liquefaction Initiation'!R20,IF(Option_PL_FSL=\"PL\",'PB Liquefaction Initiation'!T20,NA())),NA())","v":0.34818708198556969},{"$f":"IF(AND(Method_BI=TRUE,J36<>\"\"),IF(units=1,'PB Settlement'!AI18,CONVERT('PB Settlement'!AI18,\"cm\",\"in\")),NA())","v":1.4594910027926975},{"$f":"IF(Method_Cetin=TRUE,'PB Liquefaction Initiation'!$D53,NA())","v":10.322847584760181},{"$f":"IF(Method_Cetin=TRUE,'PB Liquefaction Initiation'!J53,NA())","v":48.264406886072805},{"$f":"IF(Method_Cetin=TRUE,'PB Liquefaction Initiation'!M53,NA())","v":1.5875075349827623},{"$f":"IF(Method_Cetin=TRUE,IF(Option_PL_FSL=\"FSL\",'PB Liquefaction Initiation'!K53,IF(Option_PL_FSL=\"PL\",'PB Liquefaction Initiation'!L53,NA())),NA())","v":6.3839566880304122E-2},{"$f":"IF(AND(Method_Cetin=TRUE,'Final Summary'!J36<>\"\"),IF(units=1,'PB Settlement'!AI46,CONVERT('PB Settlement'!AI46,\"cm\",\"in\")),NA())","v":1.0906612342889093},{"$f":"IF(Inputs!$B23=\"\",\"\",Inputs!$B23)","v":51.5},{"$f":"IF(Method_BI=TRUE,IF('PB Liquefaction Initiation'!$F20=\"\",NA(),'PB Liquefaction Initiation'!$F20),NA())","v":9.6599215676559655},{"$f":"IF(Method_BI=TRUE,IF(Inputs!J23=\"No\",NA(),'Det Liquefaction Initiation'!P20),NA())","v":34.066644668579102},{"$f":"IF(Method_BI=TRUE,'Det Liquefaction Initiation'!S20,NA())","v":0.69886017471582129},{"$f":"IF(Method_BI=TRUE,IF(Option_PL_FSL=\"FSL\",'Det Liquefaction Initiation'!Q20,'Det Liquefaction Initiation'!R20),NA())","v":0.14315320799813824},{"$f":"IF(Det_Liq_Option=FALSE,NA(),IF(AND(Method_BI=TRUE,U36<>\"\"),IF(units=1,'Det Settlement'!U17,CONVERT('Det Settlement'!U17,\"cm\",\"in\")),NA()))","v":0.91533927204430754},{"$f":"IF(Method_Cetin=TRUE,'PB Liquefaction Initiation'!$D53,NA())","v":10.322847584760181},{"$f":"IF(Method_Cetin=TRUE,'Det Liquefaction Initiation'!K53,NA())","v":44.606581970585999},{"$f":"IF(Method_Cetin=TRUE,'Det Liquefaction Initiation'!N53,NA())","v":0.89054594014891797},{"$f":"IF(Method_Cetin=TRUE,IF(Option_PL_FSL=\"FSL\",'Det Liquefaction Initiation'!L53,'Det Liquefaction Initiation'!M53),NA())","v":0.13392474304154969},{"$f":"IF(Det_Liq_Option=FALSE,NA(),IF(AND(Method_Cetin=TRUE,'Final Summary'!U36<>\"\"),IF(units=1,'Det Settlement'!U43,CONVERT('Det Settlement'!U43,\"cm\",\"in\")),NA()))","v":1.1520365113268556},"Simplified PB Results:",null,null,null,"Deterministic Results:"]
["Vs,12 =",{"$f":"IF(Vs12_prob=\"\",\"\",Vs12_prob)","v":623},{"$f":"IF(units=1,\"m/s\",\"ft/s\")","v":"ft/s"},null,null,"εv,IshiharaYoshimine(%)ref =",{"$f":"IF(strain_ref_iy=\"\",\"\",strain_ref_iy)","v":2.2999999999999998},null,null,{"$f":"IF(Inputs!$B24=\"\",\"\",Inputs!$B24)","v":57},{"$f":"IF(Method_BI=TRUE,IF('PB Liquefaction Initiation'!$F21=\"\",NA(),'PB Liquefaction Initiation'!$F21),NA())","v":2.3758590121854533},{"$f":"IF(AND(Method_BI=TRUE,Inputs!J24=\"Yes\"),'PB Liquefaction Initiation'!S21,NA())","v":26.304130554199219},{"$f":"IF(Method_BI=TRUE,IF('PB Liquefaction Initiation'!P21=\"\",\"\",'PB Liquefaction Initiation'!P21),NA())","v":0.36959317274726489},{"$f":"IF(Method_BI=TRUE,IF(Option_PL_FSL=\"FSL\",'PB Liquefaction Initiation'!R21,IF(Option_PL_FSL=\"PL\",'PB Liquefaction Initiation'!T21,NA())),NA())","v":0.22163239568277454},{"$f":"IF(AND(Method_BI=TRUE,J37<>\"\"),IF(units=1,'PB Settlement'!AI19,CONVERT('PB Settlement'!AI19,\"cm\",\"in\")),NA())","v":0.45487734387050432},{"$f":"IF(Method_Cetin=TRUE,'PB Liquefaction Initiation'!$D54,NA())","v":2.9720420997108414},{"$f":"IF(Method_Cetin=TRUE,'PB Liquefaction Initiation'!J54,NA())","v":48.128747582366231},{"$f":"IF(Method_Cetin=TRUE,'PB Liquefaction Initiation'!M54,NA())","v":1.5283968779578039},{"$f":"IF(Method_Cetin=TRUE,IF(Option_PL_FSL=\"FSL\",'PB Liquefaction Initiation'!K54,IF(Option_PL_FSL=\"PL\",'PB Liquefaction Initiation'!L54,NA())),NA())","v":3.783207723839474E-2},{"$f":"IF(AND(Method_Cetin=TRUE,'Final Summary'!J37<>\"\"),IF(units=1,'PB Settlement'!AI47,CONVERT('PB Settlement'!AI47,\"cm\",\"in\")),NA())","v":0.24462612610704398},{"$f":"IF(Inputs!$B24=\"\",\"\",Inputs!$B24)","v":57},{"$f":"IF(Method_BI=TRUE,IF('PB Liquefaction Initiation'!$F21=\"\",NA(),'PB Liquefaction Initiation'!$F21),NA())","v":2.3758590121854533},{"$f":"IF(Method_BI=TRUE,IF(Inputs!J24=\"No\",NA(),'Det Liquefaction Initiation'!P21),NA())","v":33.938884735107422},{"$f":"IF(Method_BI=TRUE,'Det Liquefaction Initiation'!S21,NA())","v":0.68217702333422126},{"$f":"IF(Method_BI=TRUE,IF(Option_PL_FSL=\"FSL\",'Det Liquefaction Initiation'!Q21,'Det Liquefaction Initiation'!R21),NA())","v":9.1164811049488759E-2},{"$f":"IF(Det_Liq_Option=FALSE,NA(),IF(AND(Method_BI=TRUE,U37<>\"\"),IF(units=1,'Det Settlement'!U18,CONVERT('Det Settlement'!U18,\"cm\",\"in\")),NA()))","v":0.19860139281995717},{"$f":"IF(Method_Cetin=TRUE,'PB Liquefaction Initiation'!$D54,NA())","v":2.9720420997108414},{"$f":"IF(Method_Cetin=TRUE,'Det Liquefaction Initiation'!K54,NA())","v":44.798084490646112},{"$f":"IF(Method_Cetin=TRUE,'Det Liquefaction Initiation'!N54,NA())","v":0.87797090607324668},{"$f":"IF(Method_Cetin=TRUE,IF(Option_PL_FSL=\"FSL\",'Det Liquefaction Initiation'!L54,'Det Liquefaction Initiation'!M54),NA())","v":7.7504626482994235E-2},{"$f":"IF(Det_Liq_Option=FALSE,NA(),IF(AND(Method_Cetin=TRUE,'Final Summary'!U37<>\"\"),IF(units=1,'Det Settlement'!U44,CONVERT('Det Settlement'!U44,\"cm\",\"in\")),NA()))","v":0.23040130867282385}]
["Site Class =",{"$f":"IF(Class=\"\",\"\",Class)","v":"D"},null,null,null,"TR =",{"$f":"IF(Tr=\"\",\"\",Tr)","v":2475},"yrs",null,{"$f":"IF(Inputs!$B25=\"\",\"\",Inputs!$B25)","v":""},{"$f":"IF(Method_BI=TRUE,IF('PB Liquefaction Initiation'!$F22=\"\",NA(),'PB Liquefaction Initiation'!$F22),NA())","v":{"$error":"#N/A"}},{"$f":"IF(AND(Method_BI=TRUE,Inputs!J25=\"Yes\"),'PB Liquefaction Initiation'!S22,NA())","v":{"$error":"#N/A"}},{"$f":"IF(Method_BI=TRUE,IF('PB Liquefaction Initiation'!P22=\"\",\"\",'PB Liquefaction Initiation'!P22),NA())","v":{"$error":"#N/A"}},{"$f":"IF(Method_BI=TRUE,IF(Option_PL_FSL=\"FSL\",'PB Liquefaction Initiation'!R22,IF(Option_PL_FSL=\"PL\",'PB Liquefaction Initiation'!T22,NA())),NA())","v":{"$error":"#N/A"}},{"$f":"IF(AND(Method_BI=TRUE,J38<>\"\"),IF(units=1,'PB Settlement'!AI20,CONVERT('PB Settlement'!AI20,\"cm\",\"in\")),NA())","v":{"$error":"#N/A"}},{"$f":"IF(Method_Cetin=TRUE,'PB Liquefaction Initiation'!$D55,NA())","v":{"$error":"#N/A"}},{"$f":"IF(Method_Cetin=TRUE,'PB Liquefaction Initiation'!J55,NA())","v":{"$error":"#N/A"}},{"$f":"IF(Method_Cetin=TRUE,'PB Liquefaction Initiation'!M55,NA())","v":{"$error":"#N/A"}},{"$f":"IF(Method_Cetin=TRUE,IF(Option_PL_FSL=\"FSL\",'PB Liquefaction Initiation'!K55,IF(Option_PL_FSL=\"PL\",'PB Liquefaction Initiation'!L55,NA())),NA())","v":{"$error":"#N/A"}},{"$f":"IF(AND(Method_Cetin=TRUE,'Final Summary'!J38<>\"\"),IF(units=1,'PB Settlement'!AI48,CONVERT('PB Settlement'!AI48,\"cm\",\"in\")),NA())","v":{"$error":"#N/A"}},{"$f":"IF(Inputs!$B25=\"\",\"\",Inputs!$B25)","v":""},{"$f":"IF(Method_BI=TRUE,IF('PB Liquefaction Initiation'!$F22=\"\",NA(),'PB Liquefaction Initiation'!$F22),NA())","v":{"$error":"#N/A"}},{"$f":"IF(Method_BI=TRUE,IF(Inputs!J25=\"No\",NA(),'Det Liquefaction Initiation'!P22),NA())","v":{"$error":"#N/A"}},{"$f":"IF(Method_BI=TRUE,'Det Liquefaction Initiation'!S22,NA())","v":{"$error":"#N/A"}},{"$f":"IF(Method_BI=TRUE,IF(Option_PL_FSL=\"FSL\",'Det Liquefaction Initiation'!Q22,'Det Liquefaction Initiation'!R22),NA())","v":{"$error":"#N/A"}},{"$f":"IF(Det_Liq_Option=FALSE,NA(),IF(AND(Method_BI=TRUE,U38<>\"\"),IF(units=1,'Det Settlement'!U19,CONVERT('Det Settlement'!U19,\"cm\",\"in\")),NA()))","v":{"$error":"#N/A"}},{"$f":"IF(Method_Cetin=TRUE,'PB Liquefaction Initiation'!$D55,NA())","v":{"$error":"#N/A"}},{"$f":"IF(Method_Cetin=TRUE,'Det Liquefaction Initiation'!K55,NA())","v":{"$error":"#N/A"}},{"$f":"IF(Method_Cetin=TRUE,'Det Liquefaction Initiation'!N55,NA())","v":{"$error":"#N/A"}},{"$f":"IF(Method_Cetin=TRUE,IF(Option_PL_FSL=\"FSL\",'Det Liquefaction Initiation'!L55,'Det Liquefaction Initiation'!M55),NA())","v":{"$error":"#N/A"}},{"$f":"IF(Det_Liq_Option=FALSE,NA(),IF(AND(Method_Cetin=TRUE,'Final Summary'!U38<>\"\"),IF(units=1,'Det Settlement'!U45,CONVERT('Det Settlement'!U45,\"cm\",\"in\")),NA()))","v":{"$error":"#N/A"}},null,"DR&Ssite =",{"$f":"IF(AND('Slope Displacement'!C8<=0.1,'Slope Displacement'!C6<=0.17),NA(),IF(Simp_SS_Option=TRUE,IF(units=2,CONVERT(Simp_RS,\"cm\",\"in\"),Simp_RS),NA()))","v":0.19667864595172022},{"$f":"IF(units=1,\"cm\",\"in\")","v":"in"},null,"DR&S =",{"$f":"IF(Det_SS_option=TRUE,IF(units=2,CONVERT(Det_RS,\"cm\",\"in\"),Det_RS),NA())","v":26.872952765346021},{"$f":"IF(units=1,\"cm\",\"in\")","v":"in"}]
[null,null,null,null,null,"Probability of Exceedance =",{"$f":"IF(PE=\"\",\"\",PE)","v":"2% in 50 yrs"},null,null,{"$f":"IF(Inputs!$B26=\"\",\"\",Inputs!$B26)","v":""},{"$f":"IF(Method_BI=TRUE,IF('PB Liquefaction Initiation'!$F23=\"\",NA(),'PB Liquefaction Initiation'!$F23),NA())","v":{"$error":"#N/A"}},{"$f":"IF(AND(Method_BI=TRUE,Inputs!J26=\"Yes\"),'PB Liquefaction Initiation'!S23,NA())","v":{"$error":"#N/A"}},{"$f":"IF(Method_BI=TRUE,IF('PB Liquefaction Initiation'!P23=\"\",\"\",'PB Liquefaction Initiation'!P23),NA())","v":{"$error":"#N/A"}},{"$f":"IF(Method_BI=TRUE,IF(Option_PL_FSL=\"FSL\",'PB Liquefaction Initiation'!R23,IF(Option_PL_FSL=\"PL\",'PB Liquefaction Initiation'!T23,NA())),NA())","v":{"$error":"#N/A"}},{"$f":"IF(AND(Method_BI=TRUE,J39<>\"\"),IF(units=1,'PB Settlement'!AI21,CONVERT('PB Settlement'!AI21,\"cm\",\"in\")),NA())","v":{"$error":"#N/A"}},{"$f":"IF(Method_Cetin=TRUE,'PB Liquefaction Initiation'!$D56,NA())","v":{"$error":"#N/A"}},{"$f":"IF(Method_Cetin=TRUE,'PB Liquefaction Initiation'!J56,NA())","v":{"$error":"#N/A"}},{"$f":"IF(Method_Cetin=TRUE,'PB Liquefaction Initiation'!M56,NA())","v":{"$error":"#N/A"}},{"$f":"IF(Method_Cetin=TRUE,IF(Option_PL_FSL=\"FSL\",'PB Liquefaction Initiation'!K56,IF(Option_PL_FSL=\"PL\",'PB Liquefaction Initiation'!L56,NA())),NA())","v":{"$error":"#N/A"}},{"$f":"IF(AND(Method_Cetin=TRUE,'Final Summary'!J39<>\"\"),IF(units=1,'PB Settlement'!AI49,CONVERT('PB Settlement'!AI49,\"cm\",\"in\")),NA())","v":{"$error":"#N/A"}},{"$f":"IF(Inputs!$B26=\"\",\"\",Inputs!$B26)","v":""},{"$f":"IF(Method_BI=TRUE,IF('PB Liquefaction Initiation'!$F23=\"\",NA(),'PB Liquefaction Initiation'!$F23),NA())","v":{"$error":"#N/A"}},{"$f":"IF(Method_BI=TRUE,IF(Inputs!J26=\"No\",NA(),'Det Liquefaction Initiation'!P23),NA())","v":{"$error":"#N/A"}},{"$f":"IF(Method_BI=TRUE,'Det Liquefaction Initiation'!S23,NA())","v":{"$error":"#N/A"}},{"$f":"IF(Method_BI=TRUE,IF(Option_PL_FSL=\"FSL\",'Det Liquefaction Initiation'!Q23,'Det Liquefaction Initiation'!R23),NA())","v":{"$error":"#N/A"}},{"$f":"IF(Det_Liq_Option=FALSE,NA(),IF(AND(Method_BI=TRUE,U39<>\"\"),IF(units=1,'Det Settlement'!U20,CONVERT('Det Settlement'!U20,\"cm\",\"in\")),NA()))","v":{"$error":"#N/A"}},{"$f":"IF(Method_Cetin=TRUE,'PB Liquefaction Initiation'!$D56,NA())","v":{"$error":"#N/A"}},{"$f":"IF(Method_Cetin=TRUE,'Det Liquefaction Initiation'!K56,NA())","v":{"$error":"#N/A"}},{"$f":"IF(Method_Cetin=TRUE,'Det Liquefaction Initiation'!N56,NA())","v":{"$error":"#N/A"}},{"$f":"IF(Method_Cetin=TRUE,IF(Option_PL_FSL=\"FSL\",'Det Liquefaction Initiation'!L56,'Det Liquefaction Initiation'!M56),NA())","v":{"$error":"#N/A"}},{"$f":"IF(Det_Liq_Option=FALSE,NA(),IF(AND(Method_Cetin=TRUE,'Final Summary'!U39<>\"\"),IF(units=1,'Det Settlement'!U46,CONVERT('Det Settlement'!U46,\"cm\",\"in\")),NA()))","v":{"$error":"#N/A"}}]
[null,null,null,null,null,null,null,null,null,{"$f":"IF(Inputs!$B27=\"\",\"\",Inputs!$B27)","v":""},{"$f":"IF(Method_BI=TRUE,IF('PB Liquefaction Initiation'!$F24=\"\",NA(),'PB Liquefaction Initiation'!$F24),NA())","v":{"$error":"#N/A"}},{"$f":"IF(AND(Method_BI=TRUE,Inputs!J27=\"Yes\"),'PB Liquefaction Initiation'!S24,NA())","v":{"$error":"#N/A"}},{"$f":"IF(Method_BI=TRUE,IF('PB Liquefaction Initiation'!P24=\"\",\"\",'PB Liquefaction Initiation'!P24),NA())","v":{"$error":"#N/A"}},{"$f":"IF(Method_BI=TRUE,IF(Option_PL_FSL=\"FSL\",'PB Liquefaction Initiation'!R24,IF(Option_PL_FSL=\"PL\",'PB Liquefaction Initiation'!T24,NA())),NA())","v":{"$error":"#N/A"}},{"$f":"IF(AND(Method_BI=TRUE,J40<>\"\"),IF(units=1,'PB Settlement'!AI22,CONVERT('PB Settlement'!AI22,\"cm\",\"in\")),NA())","v":{"$error":"#N/A"}},{"$f":"IF(Method_Cetin=TRUE,'PB Liquefaction Initiation'!$D57,NA())","v":{"$error":"#N/A"}},{"$f":"IF(Method_Cetin=TRUE,'PB Liquefaction Initiation'!J57,NA())","v":{"$error":"#N/A"}},{"$f":"IF(Method_Cetin=TRUE,'PB Liquefaction Initiation'!M57,NA())","v":{"$error":"#N/A"}},{"$f":"IF(Method_Cetin=TRUE,IF(Option_PL_FSL=\"FSL\",'PB Liquefaction Initiation'!K57,IF(Option_PL_FSL=\"PL\",'PB Liquefaction Initiation'!L57,NA())),NA())","v":{"$error":"#N/A"}},{"$f":"IF(AND(Method_Cetin=TRUE,'Final Summary'!J40<>\"\"),IF(units=1,'PB Settlement'!AI50,CONVERT('PB Settlement'!AI50,\"cm\",\"in\")),NA())","v":{"$error":"#N/A"}},{"$f":"IF(Inputs!$B27=\"\",\"\",Inputs!$B27)","v":""},{"$f":"IF(Method_BI=TRUE,IF('PB Liquefaction Initiation'!$F24=\"\",NA(),'PB Liquefaction Initiation'!$F24),NA())","v":{"$error":"#N/A"}},{"$f":"IF(Method_BI=TRUE,IF(Inputs!J27=\"No\",NA(),'Det Liquefaction Initiation'!P24),NA())","v":{"$error":"#N/A"}},{"$f":"IF(Method_BI=TRUE,'Det Liquefaction Initiation'!S24,NA())","v":{"$error":"#N/A"}},{"$f":"IF(Method_BI=TRUE,IF(Option_PL_FSL=\"FSL\",'Det Liquefaction Initiation'!Q24,'Det Liquefaction Initiation'!R24),NA())","v":{"$error":"#N/A"}},{"$f":"IF(Det_Liq_Option=FALSE,NA(),IF(AND(Method_BI=TRUE,U40<>\"\"),IF(units=1,'Det Settlement'!U21,CONVERT('Det Settlement'!U21,\"cm\",\"in\")),NA()))","v":{"$error":"#N/A"}},{"$f":"IF(Method_Cetin=TRUE,'PB Liquefaction Initiation'!$D57,NA())","v":{"$error":"#N/A"}},{"$f":"IF(Method_Cetin=TRUE,'Det Liquefaction Initiation'!K57,NA())","v":{"$error":"#N/A"}},{"$f":"IF(Method_Cetin=TRUE,'Det Liquefaction Initiation'!N57,NA())","v":{"$error":"#N/A"}},{"$f":"IF(Method_Cetin=TRUE,IF(Option_PL_FSL=\"FSL\",'Det Liquefaction Initiation'!L57,'Det Liquefaction Initiation'!M57),NA())","v":{"$error":"#N/A"}},{"$f":"IF(Det_Liq_Option=FALSE,NA(),IF(AND(Method_Cetin=TRUE,'Final Summary'!U40<>\"\"),IF(units=1,'Det Settlement'!U47,CONVERT('Det Settlement'!U47,\"cm\",\"in\")),NA()))","v":{"$error":"#N/A"}},null,"DB&Tsite =",{"$f":"IF(Simp_SS_Option=TRUE,IF(units=2,CONVERT(Simp_BT,\"cm\",\"in\"),Simp_BT),NA())","v":0.53798706822209397},{"$f":"IF(units=1,\"cm\",\"in\")","v":"in"},null,"DB&T =",{"$f":"IF(Det_SS_option=TRUE,IF(units=2,CONVERT(Det_BT,\"cm\",\"in\"),Det_BT),NA())","v":11.996140238698972},{"$f":"IF(units=1,\"cm\",\"in\")","v":"in"}]
["Deterministic Analysis Parameters:",null,null,null,null,"Site Location:",null,null,null,{"$f":"IF(Inputs!$B28=\"\",\"\",Inputs!$B28)","v":""},{"$f":"IF(Method_BI=TRUE,IF('PB Liquefaction Initiation'!$F25=\"\",NA(),'PB Liquefaction Initiation'!$F25),NA())","v":{"$error":"#N/A"}},{"$f":"IF(AND(Method_BI=TRUE,Inputs!J28=\"Yes\"),'PB Liquefaction Initiation'!S25,NA())","v":{"$error":"#N/A"}},{"$f":"IF(Method_BI=TRUE,IF('PB Liquefaction Initiation'!P25=\"\",\"\",'PB Liquefaction Initiation'!P25),NA())","v":{"$error":"#N/A"}},{"$f":"IF(Method_BI=TRUE,IF(Option_PL_FSL=\"FSL\",'PB Liquefaction Initiation'!R25,IF(Option_PL_FSL=\"PL\",'PB Liquefaction Initiation'!T25,NA())),NA())","v":{"$error":"#N/A"}},{"$f":"IF(AND(Method_BI=TRUE,J41<>\"\"),IF(units=1,'PB Settlement'!AI23,CONVERT('PB Settlement'!AI23,\"cm\",\"in\")),NA())","v":{"$error":"#N/A"}},{"$f":"IF(Method_Cetin=TRUE,'PB Liquefaction Initiation'!$D58,NA())","v":{"$error":"#N/A"}},{"$f":"IF(Method_Cetin=TRUE,'PB Liquefaction Initiation'!J58,NA())","v":{"$error":"#N/A"}},{"$f":"IF(Method_Cetin=TRUE,'PB Liquefaction Initiation'!M58,NA())","v":{"$error":"#N/A"}},{"$f":"IF(Method_Cetin=TRUE,IF(Option_PL_FSL=\"FSL\",'PB Liquefaction Initiation'!K58,IF(Option_PL_FSL=\"PL\",'PB Liquefaction Initiation'!L58,NA())),NA())","v":{"$error":"#N/A"}},{"$f":"IF(AND(Method_Cetin=TRUE,'Final Summary'!J41<>\"\"),IF(units=1,'PB Settlement'!AI51,CONVERT('PB Settlement'!AI51,\"cm\",\"in\")),NA())","v":{"$error":"#N/A"}},{"$f":"IF(Inputs!$B28=\"\",\"\",Inputs!$B28)","v":""},{"$f":"IF(Method_BI=TRUE,IF('PB Liquefaction Initiation'!$F25=\"\",NA(),'PB Liquefaction Initiation'!$F25),NA())","v":{"$error":"#N/A"}},{"$f":"IF(Method_BI=TRUE,IF(Inputs!J28=\"No\",NA(),'Det Liquefaction Initiation'!P25),NA())","v":{"$error":"#N/A"}},{"$f":"IF(Method_BI=TRUE,'Det Liquefaction Initiation'!S25,NA())","v":{"$error":"#N/A"}},{"$f":"IF(Method_BI=TRUE,IF(Option_PL_FSL=\"FSL\",'Det Liquefaction Initiation'!Q25,'Det Liquefaction Initiation'!R25),NA())","v":{"$error":"#N/A"}},{"$f":"IF(Det_Liq_Option=FALSE,NA(),IF(AND(Method_BI=TRUE,U41<>\"\"),IF(units=1,'Det Settlement'!U22,CONVERT('Det Settlement'!U22,\"cm\",\"in\")),NA()))","v":{"$error":"#N/A"}},{"$f":"IF(Method_Cetin=TRUE,'PB Liquefaction Initiation'!$D58,NA())","v":{"$error":"#N/A"}},{"$f":"IF(Method_Cetin=TRUE,'Det Liquefaction Initiation'!K58,NA())","v":{"$error":"#N/A"}},{"$f":"IF(Method_Cetin=TRUE,'Det Liquefaction Initiation'!N58,NA())","v":{"$error":"#N/A"}},{"$f":"IF(Method_Cetin=TRUE,IF(Option_PL_FSL=\"FSL\",'Det Liquefaction Initiation'!L58,'Det Liquefaction Initiation'!M58),NA())","v":{"$error":"#N/A"}},{"$f":"IF(Det_Liq_Option=FALSE,NA(),IF(AND(Method_Cetin=TRUE,'Final Summary'!U41<>\"\"),IF(units=1,'Det Settlement'!U48,CONVERT('Det Settlement'!U48,\"cm\",\"in\")),NA()))","v":{"$error":"#N/A"}}]
["PGA =",{"$f":"IF(PGA_det=\"\",\"\",PGA_det)","v":0.73},null,null,{"$f":"F2","v":"Salt Lake City, UT"},null,null,null,null,{"$f":"IF(Inputs!$B29=\"\",\"\",Inputs!$B29)","v":""},{"$f":"IF(Method_BI=TRUE,IF('PB Liquefaction Initiation'!$F26=\"\",NA(),'PB Liquefaction Initiation'!$F26),NA())","v":{"$error":"#N/A"}},{"$f":"IF(AND(Method_BI=TRUE,Inputs!J29=\"Yes\"),'PB Liquefaction Initiation'!S26,NA())","v":{"$error":"#N/A"}},{"$f":"IF(Method_BI=TRUE,IF('PB Liquefaction Initiation'!P26=\"\",\"\",'PB Liquefaction Initiation'!P26),NA())","v":{"$error":"#N/A"}},{"$f":"IF(Method_BI=TRUE,IF(Option_PL_FSL=\"FSL\",'PB Liquefaction Initiation'!R26,IF(Option_PL_FSL=\"PL\",'PB Liquefaction Initiation'!T26,NA())),NA())","v":{"$error":"#N/A"}},{"$f":"IF(AND(Method_BI=TRUE,J42<>\"\"),IF(units=1,'PB Settlement'!AI24,CONVERT('PB Settlement'!AI24,\"cm\",\"in\")),NA())","v":{"$error":"#N/A"}},{"$f":"IF(Method_Cetin=TRUE,'PB Liquefaction Initiation'!$D59,NA())","v":{"$error":"#N/A"}},{"$f":"IF(Method_Cetin=TRUE,'PB Liquefaction Initiation'!J59,NA())","v":{"$error":"#N/A"}},{"$f":"IF(Method_Cetin=TRUE,'PB Liquefaction Initiation'!M59,NA())","v":{"$error":"#N/A"}},{"$f":"IF(Method_Cetin=TRUE,IF(Option_PL_FSL=\"FSL\",'PB Liquefaction Initiation'!K59,IF(Option_PL_FSL=\"PL\",'PB Liquefaction Initiation'!L59,NA())),NA())","v":{"$error":"#N/A"}},{"$f":"IF(AND(Method_Cetin=TRUE,'Final Summary'!J42<>\"\"),IF(units=1,'PB Settlement'!AI52,CONVERT('PB Settlement'!AI52,\"cm\",\"in\")),NA())","v":{"$error":"#N/A"}},{"$f":"IF(Inputs!$B29=\"\",\"\",Inputs!$B29)","v":""},{"$f":"IF(Method_BI=TRUE,IF('PB Liquefaction Initiation'!$F26=\"\",NA(),'PB Liquefaction Initiation'!$F26),NA())","v":{"$error":"#N/A"}},{"$f":"IF(Method_BI=TRUE,IF(Inputs!J29=\"No\",NA(),'Det Liquefaction Initiation'!P26),NA())","v":{"$error":"#N/A"}},{"$f":"IF(Method_BI=TRUE,'Det Liquefaction Initiation'!S26,NA())","v":{"$error":"#N/A"}},{"$f":"IF(Method_BI=TRUE,IF(Option_PL_FSL=\"FSL\",'Det Liquefaction Initiation'!Q26,'Det Liquefaction Initiation'!R26),NA())","v":{"$error":"#N/A"}},{"$f":"IF(Det_Liq_Option=FALSE,NA(),IF(AND(Method_BI=TRUE,U42<>\"\"),IF(units=1,'Det Settlement'!U23,CONVERT('Det Settlement'!U23,\"cm\",\"in\")),NA()))","v":{"$error":"#N/A"}},{"$f":"IF(Method_Cetin=TRUE,'PB Liquefaction Initiation'!$D59,NA())","v":{"$error":"#N/A"}},{"$f":"IF(Method_Cetin=TRUE,'Det Liquefaction Initiation'!K59,NA())","v":{"$error":"#N/A"}},{"$f":"IF(Method_Cetin=TRUE,'Det Liquefaction Initiation'!N59,NA())","v":{"$error":"#N/A"}},{"$f":"IF(Method_Cetin=TRUE,IF(Option_PL_FSL=\"FSL\",'Det Liquefaction Initiation'!L59,'Det Liquefaction Initiation'!M59),NA())","v":{"$error":"#N/A"}},{"$f":"IF(Det_Liq_Option=FALSE,NA(),IF(AND(Method_Cetin=TRUE,'Final Summary'!U42<>\"\"),IF(units=1,'Det Settlement'!U49,CONVERT('Det Settlement'!U49,\"cm\",\"in\")),NA()))","v":{"$error":"#N/A"}}]
["FPGA =",{"$f":"IF(Fpga_det=\"\",\"\",Fpga_det)","v":1},null,null,null,"Latitude:",{"$f":"IF(Lat=\"\",\"\",Lat)","v":40.674579999999999},null,null,{"$f":"IF(Inputs!$B30=\"\",\"\",Inputs!$B30)","v":""},{"$f":"IF(Method_BI=TRUE,IF('PB Liquefaction Initiation'!$F27=\"\",NA(),'PB Liquefaction Initiation'!$F27),NA())","v":{"$error":"#N/A"}},{"$f":"IF(AND(Method_BI=TRUE,Inputs!J30=\"Yes\"),'PB Liquefaction Initiation'!S27,NA())","v":{"$error":"#N/A"}},{"$f":"IF(Method_BI=TRUE,IF('PB Liquefaction Initiation'!P27=\"\",\"\",'PB Liquefaction Initiation'!P27),NA())","v":{"$error":"#N/A"}},{"$f":"IF(Method_BI=TRUE,IF(Option_PL_FSL=\"FSL\",'PB Liquefaction Initiation'!R27,IF(Option_PL_FSL=\"PL\",'PB Liquefaction Initiation'!T27,NA())),NA())","v":{"$error":"#N/A"}},{"$f":"IF(AND(Method_BI=TRUE,J43<>\"\"),IF(units=1,'PB Settlement'!AI25,CONVERT('PB Settlement'!AI25,\"cm\",\"in\")),NA())","v":{"$error":"#N/A"}},{"$f":"IF(Method_Cetin=TRUE,'PB Liquefaction Initiation'!$D60,NA())","v":{"$error":"#N/A"}},{"$f":"IF(Method_Cetin=TRUE,'PB Liquefaction Initiation'!J60,NA())","v":{"$error":"#N/A"}},{"$f":"IF(Method_Cetin=TRUE,'PB Liquefaction Initiation'!M60,NA())","v":{"$error":"#N/A"}},{"$f":"IF(Method_Cetin=TRUE,IF(Option_PL_FSL=\"FSL\",'PB Liquefaction Initiation'!K60,IF(Option_PL_FSL=\"PL\",'PB Liquefaction Initiation'!L60,NA())),NA())","v":{"$error":"#N/A"}},{"$f":"IF(AND(Method_Cetin=TRUE,'Final Summary'!J43<>\"\"),IF(units=1,'PB Settlement'!AI53,CONVERT('PB Settlement'!AI53,\"cm\",\"in\")),NA())","v":{"$error":"#N/A"}},{"$f":"IF(Inputs!$B30=\"\",\"\",Inputs!$B30)","v":""},{"$f":"IF(Method_BI=TRUE,IF('PB Liquefaction Initiation'!$F27=\"\",NA(),'PB Liquefaction Initiation'!$F27),NA())","v":{"$error":"#N/A"}},{"$f":"IF(Method_BI=TRUE,IF(Inputs!J30=\"No\",NA(),'Det Liquefaction Initiation'!P27),NA())","v":{"$error":"#N/A"}},{"$f":"IF(Method_BI=TRUE,'Det Liquefaction Initiation'!S27,NA())","v":{"$error":"#N/A"}},{"$f":"IF(Method_BI=TRUE,IF(Option_PL_FSL=\"FSL\",'Det Liquefaction Initiation'!Q27,'Det Liquefaction Initiation'!R27),NA())","v":{"$error":"#N/A"}},{"$f":"IF(Det_Liq_Option=FALSE,NA(),IF(AND(Method_BI=TRUE,U43<>\"\"),IF(units=1,'Det Settlement'!U24,CONVERT('Det Settlement'!U24,\"cm\",\"in\")),NA()))","v":{"$error":"#N/A"}},{"$f":"IF(Method_Cetin=TRUE,'PB Liquefaction Initiation'!$D60,NA())","v":{"$error":"#N/A"}},{"$f":"IF(Method_Cetin=TRUE,'Det Liquefaction Initiation'!K60,NA())","v":{"$error":"#N/A"}},{"$f":"IF(Method_Cetin=TRUE,'Det Liquefaction Initiation'!N60,NA())","v":{"$error":"#N/A"}},{"$f":"IF(Method_Cetin=TRUE,IF(Option_PL_FSL=\"FSL\",'Det Liquefaction Initiation'!L60,'Det Liquefaction Initiation'!M60),NA())","v":{"$error":"#N/A"}},{"$f":"IF(Det_Liq_Option=FALSE,NA(),IF(AND(Method_Cetin=TRUE,'Final Summary'!U43<>\"\"),IF(units=1,'Det Settlement'!U50,CONVERT('Det Settlement'!U50,\"cm\",\"in\")),NA()))","v":{"$error":"#N/A"}}]
["Mw =",{"$f":"IF(Mw_det=\"\",\"\",Mw_det)","v":6.8},null,null,null,"Longitude:",{"$f":"IF(Long=\"\",\"\",Long)","v":-111.91495},null,null,{"$f":"IF(Inputs!$B31=\"\",\"\",Inputs!$B31)","v":""},{"$f":"IF(Method_BI=TRUE,IF('PB Liquefaction Initiation'!$F28=\"\",NA(),'PB Liquefaction Initiation'!$F28),NA())","v":{"$error":"#N/A"}},{"$f":"IF(AND(Method_BI=TRUE,Inputs!J31=\"Yes\"),'PB Liquefaction Initiation'!S28,NA())","v":{"$error":"#N/A"}},{"$f":"IF(Method_BI=TRUE,IF('PB Liquefaction Initiation'!P28=\"\",\"\",'PB Liquefaction Initiation'!P28),NA())","v":{"$error":"#N/A"}},{"$f":"IF(Method_BI=TRUE,IF(Option_PL_FSL=\"FSL\",'PB Liquefaction Initiation'!R28,IF(Option_PL_FSL=\"PL\",'PB Liquefaction Initiation'!T28,NA())),NA())","v":{"$error":"#N/A"}},{"$f":"IF(AND(Method_BI=TRUE,J44<>\"\"),IF(units=1,'PB Settlement'!AI26,CONVERT('PB Settlement'!AI26,\"cm\",\"in\")),NA())","v":{"$error":"#N/A"}},{"$f":"IF(Method_Cetin=TRUE,'PB Liquefaction Initiation'!$D61,NA())","v":{"$error":"#N/A"}},{"$f":"IF(Method_Cetin=TRUE,'PB Liquefaction Initiation'!J61,NA())","v":{"$error":"#N/A"}},{"$f":"IF(Method_Cetin=TRUE,'PB Liquefaction Initiation'!M61,NA())","v":{"$error":"#N/A"}},{"$f":"IF(Method_Cetin=TRUE,IF(Option_PL_FSL=\"FSL\",'PB Liquefaction Initiation'!K61,IF(Option_PL_FSL=\"PL\",'PB Liquefaction Initiation'!L61,NA())),NA())","v":{"$error":"#N/A"}},{"$f":"IF(AND(Method_Cetin=TRUE,'Final Summary'!J44<>\"\"),IF(units=1,'PB Settlement'!AI54,CONVERT('PB Settlement'!AI54,\"cm\",\"in\")),NA())","v":{"$error":"#N/A"}},{"$f":"IF(Inputs!$B31=\"\",\"\",Inputs!$B31)","v":""},{"$f":"IF(Method_BI=TRUE,IF('PB Liquefaction Initiation'!$F28=\"\",NA(),'PB Liquefaction Initiation'!$F28),NA())","v":{"$error":"#N/A"}},{"$f":"IF(Method_BI=TRUE,IF(Inputs!J31=\"No\",NA(),'Det Liquefaction Initiation'!P28),NA())","v":{"$error":"#N/A"}},{"$f":"IF(Method_BI=TRUE,'Det Liquefaction Initiation'!S28,NA())","v":{"$error":"#N/A"}},{"$f":"IF(Method_BI=TRUE,IF(Option_PL_FSL=\"FSL\",'Det Liquefaction Initiation'!Q28,'Det Liquefaction Initiation'!R28),NA())","v":{"$error":"#N/A"}},{"$f":"IF(Det_Liq_Option=FALSE,NA(),IF(AND(Method_BI=TRUE,U44<>\"\"),IF(units=1,'Det Settlement'!U25,CONVERT('Det Settlement'!U25,\"cm\",\"in\")),NA()))","v":{"$error":"#N/A"}},{"$f":"IF(Method_Cetin=TRUE,'PB Liquefaction Initiation'!$D61,NA())","v":{"$error":"#N/A"}},{"$f":"IF(Method_Cetin=TRUE,'Det Liquefaction Initiation'!K61,NA())","v":{"$error":"#N/A"}},{"$f":"IF(Method_Cetin=TRUE,'Det Liquefaction Initiation'!N61,NA())","v":{"$error":"#N/A"}},{"$f":"IF(Method_Cetin=TRUE,IF(Option_PL_FSL=\"FSL\",'Det Liquefaction Initiation'!L61,'Det Liquefaction Initiation'!M61),NA())","v":{"$error":"#N/A"}},{"$f":"IF(Det_Liq_Option=FALSE,NA(),IF(AND(Method_Cetin=TRUE,'Final Summary'!U44<>\"\"),IF(units=1,'Det Settlement'!U51,CONVERT('Det Settlement'!U51,\"cm\",\"in\")),NA()))","v":{"$error":"#N/A"}}]
["Percentile =",{"$f":"IF(Percentile_Liq=\"\",\"\",Percentile_Liq)","v":84},null,null,null,null,null,null,null,{"$f":"IF(Inputs!$B32=\"\",\"\",Inputs!$B32)","v":""},{"$f":"IF(Method_BI=TRUE,IF('PB Liquefaction Initiation'!$F29=\"\",NA(),'PB Liquefaction Initiation'!$F29),NA())","v":{"$error":"#N/A"}},{"$f":"IF(AND(Method_BI=TRUE,Inputs!J32=\"Yes\"),'PB Liquefaction Initiation'!S29,NA())","v":{"$error":"#N/A"}},{"$f":"IF(Method_BI=TRUE,IF('PB Liquefaction Initiation'!P29=\"\",\"\",'PB Liquefaction Initiation'!P29),NA())","v":{"$error":"#N/A"}},{"$f":"IF(Method_BI=TRUE,IF(Option_PL_FSL=\"FSL\",'PB Liquefaction Initiation'!R29,IF(Option_PL_FSL=\"PL\",'PB Liquefaction Initiation'!T29,NA())),NA())","v":{"$error":"#N/A"}},{"$f":"IF(AND(Method_BI=TRUE,J45<>\"\"),IF(units=1,'PB Settlement'!AI27,CONVERT('PB Settlement'!AI27,\"cm\",\"in\")),NA())","v":{"$error":"#N/A"}},{"$f":"IF(Method_Cetin=TRUE,'PB Liquefaction Initiation'!$D62,NA())","v":{"$error":"#N/A"}},{"$f":"IF(Method_Cetin=TRUE,'PB Liquefaction Initiation'!J62,NA())","v":{"$error":"#N/A"}},{"$f":"IF(Method_Cetin=TRUE,'PB Liquefaction Initiation'!M62,NA())","v":{"$error":"#N/A"}},{"$f":"IF(Method_Cetin=TRUE,IF(Option_PL_FSL=\"FSL\",'PB Liquefaction Initiation'!K62,IF(Option_PL_FSL=\"PL\",'PB Liquefaction Initiation'!L62,NA())),NA())","v":{"$error":"#N/A"}},{"$f":"IF(AND(Method_Cetin=TRUE,'Final Summary'!J45<>\"\"),IF(units=1,'PB Settlement'!AI55,CONVERT('PB Settlement'!AI55,\"cm\",\"in\")),NA())","v":{"$error":"#N/A"}},{"$f":"IF(Inputs!$B32=\"\",\"\",Inputs!$B32)","v":""},{"$f":"IF(Method_BI=TRUE,IF('PB Liquefaction Initiation'!$F29=\"\",NA(),'PB Liquefaction Initiation'!$F29),NA())","v":{"$error":"#N/A"}},{"$f":"IF(Method_BI=TRUE,IF(Inputs!J32=\"No\",NA(),'Det Liquefaction Initiation'!P29),NA())","v":{"$error":"#N/A"}},{"$f":"IF(Method_BI=TRUE,'Det Liquefaction Initiation'!S29,NA())","v":{"$error":"#N/A"}},{"$f":"IF(Method_BI=TRUE,IF(Option_PL_FSL=\"FSL\",'Det Liquefaction Initiation'!Q29,'Det Liquefaction Initiation'!R29),NA())","v":{"$error":"#N/A"}},{"$f":"IF(Det_Liq_Option=FALSE,NA(),IF(AND(Method_BI=TRUE,U45<>\"\"),IF(units=1,'Det Settlement'!U26,CONVERT('Det Settlement'!U26,\"cm\",\"in\")),NA()))","v":{"$error":"#N/A"}},{"$f":"IF(Method_Cetin=TRUE,'PB Liquefaction Initiation'!$D62,NA())","v":{"$error":"#N/A"}},{"$f":"IF(Method_Cetin=TRUE,'Det Liquefaction Initiation'!K62,NA())","v":{"$error":"#N/A"}},{"$f":"IF(Method_Cetin=TRUE,'Det Liquefaction Initiation'!N62,NA())","v":{"$error":"#N/A"}},{"$f":"IF(Method_Cetin=TRUE,IF(Option_PL_FSL=\"FSL\",'Det Liquefaction Initiation'!L62,'Det Liquefaction Initiation'!M62),NA())","v":{"$error":"#N/A"}},{"$f":"IF(Det_Liq_Option=FALSE,NA(),IF(AND(Method_Cetin=TRUE,'Final Summary'!U45<>\"\"),IF(units=1,'Det Settlement'!U52,CONVERT('Det Settlement'!U52,\"cm\",\"in\")),NA()))","v":{"$error":"#N/A"}}]
[null,null,null,null,null,null,null,null,null,null,null,null,null,null,null,null,null,null,null,null,"*Note: The governing value is the lower value between the simplified performance-based and deterministic results"]

{"sheet":"Map Help","index":3,"n_rows":57,"n_cols":28,"rows_kept":57,"cut":false,"hidden":false,"merged":[[13,11,13,12],[14,11,14,12]]}
[]
[]
[]
[]
[null,null,null,null,null,null,null,null,null,null,null,null,null,null,null,null,null,null,null,null,null,null,null,null,null,{"$f":"IF($A5=\"\",\"\",IF($A5=\"\",\"\",$T5*$U5*$V5*$W5*$X5*$Y5))","v":""}]
[null,null,null,null,null,null,null,null,null,null,null,null,null,null,null,null,null,null,null,null,null,null,null,null,null,{"$f":"IF($A6=\"\",\"\",IF($A6=\"\",\"\",$T6*$U6*$V6*$W6*$X6*$Y6))","v":""}]
[null,null,null,null,null,null,null,null,null,null,null,null,null,null,null,null,null,null,null,null,null,null,null,null,null,""]
[null,null,null,null,null,null,null,null,null,null,null,null,null,null,null,null,null,null,null,null,null,null,null,null,null,""]
[null,null,null,null,null,null,null,null,null,null,null,null,null,null,null,null,null,null,null,null,null,null,null,null,null,""]
[null,null,null,null,null,null,null,null,null,null,null,null,null,null,null,null,null,null,null,null,null,null,null,null,null,""]
[null,null,null,null,null,null,null,null,null,null,null,null,null,null,null,null,null,null,null,null,null,null,null,null,null,""]
[null,null,null,null,null,null,null,null,null,null,null,null,null,null,null,null,null,null,null,null,null,null,null,null,null,""]
[null,null,null,null,null,null,null,null,null,null,null,null,null,null,null,null,null,null,null,null,null,null,null,null,null,""]
[null,null,null,null,null,null,null,null,null,null,null,"Mapped Value",null,null,null,null,null,null,null,null,null,null,null,null,null,""]
[null,null,null,null,null,null,null,null,null,null,null,-0.82499999999999996,null,null,null,null,null,null,null,null,null,null,null,null,null,""]
[null,null,null,null,null,null,null,null,null,null,null,null,null,null,null,null,null,null,null,null,null,null,null,null,null,""]
[null,null,null,null,null,null,null,null,null,null,null,null,null,null,null,null,null,null,null,null,null,null,null,null,null,""]
[null,null,null,null,null,null,null,null,null,null,null,null,null,null,null,null,null,null,null,null,null,null,null,null,null,""]
[null,null,null,null,null,null,null,null,null,null,null,null,null,null,null,null,null,null,null,null,null,null,null,null,null,""]
[null,null,null,null,null,null,null,null,null,null,null,null,null,null,null,null,null,null,null,null,null,null,null,null,null,""]
[null,null,null,null,null,null,null,null,null,null,null,null,null,null,null,null,null,null,null,null,null,null,null,null,null,""]
[null,null,null,null,null,null,null,null,null,null,null,null,null,null,null,null,null,null,null,null,null,null,null,null,null,""]
[null,null,null,null,null,null,null,null,null,null,null,null,null,null,null,null,null,null,null,null,null,null,null,null,null,""]
[null,null,null,null,null,null,null,null,null,null,null,null,null,null,null,null,null,null,null,null,null,null,null,null,null,""]
[]
[]
[]
[]
[]
[]
[]
[]
[]
[]
[]
[]
[]
[null,null,null,null,null,null,null,null,null,null,null,null,null,null,null,null,null,null,null,null,null,null,null,null,null,null,null,{"$f":"IF($A38=\"\",\"\",$W38*$X38*$Y38*$Z38*$AA38)","v":""}]
[null,null,null,null,null,null,null,null,null,null,null,null,null,null,null,null,null,null,null,null,null,null,null,null,null,null,null,{"$f":"IF($A39=\"\",\"\",$W39*$X39*$Y39*$Z39*$AA39)","v":""}]
[null,null,null,null,null,null,null,null,null,null,null,null,null,null,null,null,null,null,null,null,null,null,null,null,null,null,null,""]
[null,null,null,null,null,null,null,null,null,null,null,null,null,null,null,null,null,null,null,null,null,null,null,null,null,null,null,""]
[null,null,null,null,null,null,null,null,null,null,null,null,null,null,null,null,null,null,null,null,null,null,null,null,null,null,null,""]
[null,null,null,null,null,null,null,null,null,null,null,null,null,null,null,null,null,null,null,null,null,null,null,null,null,null,null,""]
[null,null,null,null,null,null,null,null,null,null,null,null,null,null,null,null,null,null,null,null,null,null,null,null,null,null,null,""]
[null,null,null,null,null,null,null,null,null,null,null,null,null,null,null,null,null,null,null,null,null,null,null,null,null,null,null,""]
[null,null,null,null,null,null,null,null,null,null,null,null,null,null,null,null,null,null,null,null,null,null,null,null,null,null,null,""]
[null,null,null,null,null,null,null,null,null,null,null,null,null,null,null,null,null,null,null,null,null,null,null,null,null,null,null,""]
[null,null,null,null,null,null,null,null,null,null,null,null,null,null,null,null,null,null,null,null,null,null,null,null,null,null,null,""]
[null,null,null,null,null,null,null,null,null,null,null,null,null,null,null,null,null,null,null,null,null,null,null,null,null,null,null,""]
[null,null,null,null,null,null,null,null,null,null,null,null,null,null,null,null,null,null,null,null,null,null,null,null,null,null,null,""]
[null,null,null,null,null,null,null,null,null,null,null,null,null,null,null,null,null,null,null,null,null,null,null,null,null,null,null,""]
[null,null,null,null,null,null,null,null,null,null,null,null,null,null,null,null,null,null,null,null,null,null,null,null,null,null,null,""]
[null,null,null,null,null,null,null,null,null,null,null,null,null,null,null,null,null,null,null,null,null,null,null,null,null,null,null,""]
[null,null,null,null,null,null,null,null,null,null,null,null,null,null,null,null,null,null,null,null,null,null,null,null,null,null,null,""]
[null,null,null,null,null,null,null,null,null,null,null,null,null,null,null,null,null,null,null,null,null,null,null,null,null,null,null,""]
[null,null,null,null,null,null,null,null,null,null,null,null,null,null,null,null,null,null,null,null,null,null,null,null,null,null,null,""]
[null,null,null,null,null,null,null,null,null,null,null,null,null,null,null,null,null,null,null,null,null,null,null,null,null,null,null,""]

{"sheet":"PB Liquefaction Initiation","index":4,"n_rows":62,"n_cols":44,"rows_kept":62,"cut":false,"hidden":false,"merged":[[0,27,2,27],[1,30,2,30],[7,20,7,21],[7,6,7,7]]}
["Simplified Performance-based Liquefaction Triggering using Boulanger & Idriss (2012)",null,null,null,null,null,null,null,null,null,null,null,null,null,null,null,null,null,null,null,null,null,"Idriss and Boulanger (2008) (N1)60 Corrections",null,null,null,null,"Borehole Diameter [mm]",null,null,null,null,null,"Idriss and Boulanger (2014) Simplified MSF Correction Factors"]
["PGA:",{"$f":"IF(Inputs!$C$36=\"\",NA(),Inputs!$C$36)","v":0.44},"g",null,null,null,null,null,null,null,null,null,null,null,null,null,null,null,null,null,null,null,null,null,null,null,null,null,null,null,"Rod Length [m]"]
["Fpga:",{"$f":"IF(Fpga=\"\",NA(),Fpga)","v":1.06},null,null,null,null,null,null,null,"Hammer Efficiency (%) =",{"$f":"Hammer_Eff","v":77},null,null,null,null,null,null,null,null,null,null,null,"Pa =",101.325,"kPa",null,null,null,"CB",null,null,"CR"]
["Depth to Water:",{"$f":"IF(design_gw=\"\",NA(),IF(units=2,CONVERT(design_gw,\"ft\",\"m\"),design_gw))","v":0},"m",null,null,null,null,null,null,"Borehole Diameter =",{"$f":"IF(units=1,Bore_Diam,CONVERT(Bore_Diam,\"in\",\"m\")*1000)","v":107.95},"mm",null,null,null,null,null,null,null,null,null,null,null,2116.2159999999999,"psf",null,null,"65 - 115 mm",1,null,"< 3",0.75]
["Mw:",{"$f":"IF(Inputs!$C$38=\"\",NA(),Inputs!$C$38)","v":6.77},null,null,null,null,null,null,null,"Rod Stickup Length =",{"$f":"IF(units=1,Rod_stickup,CONVERT(Rod_stickup,\"ft\",\"m\"))","v":1.524},"m",null,null,null,null,null,null,null,null,null,null,null,null,null,null,null,"150 mm",1.05,null,"3 - 4",0.8]
["CSRref:",{"$f":"IF(Inputs!$C$50=\"\",NA(),Inputs!$C$50)","v":35.14},"%",null,null,null,null,null,null,null,null,null,null,null,null,null,null,null,null,null,null,null,null,null,null,null,null,"200 mm",1.1499999999999999,null,"4 - 6",0.85]
["σε :",0.27700000000000002,null,null,null,null,null,null,null,null,null,null,null,null,null,null,null,null,null,null,null,null,null,null,null,null,null,null,null,null,"6 - 10",0.95]
[null,null,null,null,null,null,"Design",null,null,null,null,null,null,null,null,null,null,null,null,null,"At Time of Drilling",null,null,null,null,null,null,null,null,null,"10 - 30",1]
["Depth (m):","(N1)60","g (kN/m3)","Fines (%)","Thickness (m)","(N1)60,cs","sv (kPa)","sv' (kPa)","ΔCSRs","ΔCSRrd","ΔCSRFpga","ΔCSRKs","ΔCSRMSF","DCSR","KDR(aging)","CSRsite","CRRNsite","FSL","Nreqsite","PL","sv (kPa)","sv' (kPa)","SPT N","CN","CE","CR","CB","CS","(N1)60",null,"(N1)60 (Copy)",null,null,"MSFsitemax","MSFmaxref"]
[{"$f":"IF(Inputs!B13=\"\",\"\",IF(units=2,CONVERT(Inputs!B13,\"ft\",\"m\"),Inputs!B13))","v":0.4572},{"$f":"IF(AC10=\"\",\"\",AC10)","v":32.725000000000009},{"$f":"IF(Inputs!E13=\"\",\"\",IF(units=2,Inputs!E13*0.1571,Inputs!E13))","v":19.527529999999999},{"$f":"IF(Inputs!F13=\"\",\"\",Inputs!F13)","v":10},{"$f":"IF(Inputs!G13=\"\",\"\",IF(units=2,CONVERT(Inputs!G13,\"ft\",\"m\"),Inputs!G13))","v":0.91439999999999999},{"$f":"IF(OR(B10=\"\",Method_BI=FALSE),NA(),B10+EXP(1.63+9.7/(D10+0.01)-(15.7/(D10+0.01))^2))","v":33.874185446686866},{"$f":"IF(A10=\"\",\"\",C10*A10)","v":8.9279867159999995},{"$f":"IF(A10=\"\",\"\",IF(A10<$B$4,G10,G10-(A10-$B$4)*9.807))","v":4.4442263159999991},{"$f":"IF(OR(A10<$B$4,A10=\"\"),\"\",LN((G10/H10)/2))","v":4.437940501368893E-3},{"$f":"IF(OR(A10<$B$4,A10=\"\"),\"\",-0.6712-1.126*SIN(A10/11.73+5.133)+(0.0675+0.118*SIN(A10/11.28+5.142))*$B$5)","v":8.2749455809781491E-2},{"$f":"IF(OR(A10=\"\",A10<$B$4),\"\",LN($B$3/1))","v":5.8268908123975824E-2},{"$f":"IF(OR(A10=\"\",$A10<$B$4),\"\",LN(1.0672/(1-LN(H10/101.3)*MIN(0.3,1/(18.9-2.55*SQRT(F10))))))","v":-0.50612930629253805},{"$f":"IF(A10=\"\",\"\",IF(IB_MSF=2012,0,-LN((1+(AH10-1)*(8.64*EXP(-Mw_prob/4)-1.325))/(1+(AI10-1)*(8.64*EXP(-Mw_prob/4)-1.325)))))","v":-9.3576671759276725E-2},{"$f":"IF(OR(A10=\"\",A10<$B$4),\"\",I10+J10+K10+L10+M10)","v":-0.45424967361668855},{"$f":"IF(Inputs!H13=\"\",1,Inputs!H13)","v":1},{"$f":"IF(OR(N10=\"\",Inputs!J13=\"No\",Method_BI=FALSE),NA(),EXP(LN($B$6/100)+N10))","v":0.22311236023806372},{"$f":"IF(OR(A10=\"\",Method_BI=FALSE),NA(),O10*EXP((F10/14.1)+(F10/126)^2-(F10/23.6)^3+(F10/25.4)^4-2.67))","v":1.010930585237902},{"$f":"IF(OR(N10=\"\",Inputs!J13=\"No\",Method_BI=FALSE),NA(),Q10/P10)","v":4.531038012233954},19.147705078125,{"$f":"IF(OR(N10=\"\",Method_BI=FALSE),NA(),_xlfn.NORM.S.DIST(-LN(R10)/$B$7,TRUE))","v":2.4528218109277166E-8},{"$f":"IF(A10=\"\",\"\",C10*A10)","v":8.9279867159999995},{"$f":"IF(A10=\"\",\"\",IF(A10<IF(units=2,CONVERT(gw_depth,\"ft\",\"m\"),gw_depth),U10,U10-((A10-IF(units=2,CONVERT(gw_depth,\"ft\",\"m\"),gw_depth))*9.807)))","v":8.9279867159999995},{"$f":"IF(Inputs!C13=\"\",\"\",IF(Inputs!D13=\"Standard SS (2-in OD)\",Inputs!C13,IF(Inputs!D13=\"Non-Standard (3-in OD)\",Inputs!C13*0.44,IF(Inputs!D13=\"Non-Standard (2.5-in OD)\",Inputs!C13*0.64, IF(Inputs!D13=\"D&M SS (3.25-in OD)\",Inputs!C13*0.3786,IF(Inputs!D13=\"Custom Factor\",Inputs!C13*NFACT))))))","v":20},{"$f":"IF(A10=\"\",\"\",IF(($X$3/V10)^(0.784-0.0768*SQRT(AC10))<=1.7,($X$3/V10)^(0.784-0.0768*SQRT(AC10)),1.7))","v":1.7},{"$f":"IF(A10=\"\",\"\",Efficiency/60)","v":1.2833333333333334},{"$f":"IF(A10=\"\",\"\",IF(Rod_L+A10<3,0.75,IF(Rod_L+A10<4,0.8,IF(Rod_L+A10<6,0.85,IF(Rod_L+A10<10,0.95,1)))))","v":0.75},{"$f":"IF(A43=\"\",\"\",IF(Bore_D<=115,1,IF(Bore_D<200,1.05,1.15)))","v":1},{"$f":"IF(A10=\"\",\"\",IF(no_liners=\"NL\",IF(AC10<=10,1.1,IF(AC10>30,1.3,1+AC10/100)),1))","v":1},{"$f":"IF($A10=\"\",\"\",IF($A10=\"\",\"\",$W10*$X10*$Y10*$Z10*$AA10*$AB10))","v":32.725000000000009},null,32.725000000000009,null,null,{"$f":"MIN(1.09+(F10/31.5)^2,2.2)","v":2.2000000000000002},{"$f":"MIN(1.09+(((1.237*(-LN($B$6/100))^4)-(4.918*(-LN($B$6/100))^3)+(1.762*(-LN($B$6/100))^2)-(5.473*(-LN($B$6/100)))+33.65)/31.5)^2,2.2)","v":1.7560412973596036}]
[{"$f":"IF(Inputs!B14=\"\",\"\",IF(units=2,CONVERT(Inputs!B14,\"ft\",\"m\"),Inputs!B14))","v":1.6763999999999999},{"$f":"IF(AC11=\"\",\"\",AC11)","v":10.751253333333334},{"$f":"IF(Inputs!E14=\"\",\"\",IF(units=2,Inputs!E14*0.1571,Inputs!E14))","v":19.527529999999999},{"$f":"IF(Inputs!F14=\"\",\"\",Inputs!F14)","v":10},{"$f":"IF(Inputs!G14=\"\",\"\",IF(units=2,CONVERT(Inputs!G14,\"ft\",\"m\"),Inputs!G14))","v":1.524},{"$f":"IF(OR(B11=\"\",Method_BI=FALSE),NA(),B11+EXP(1.63+9.7/(D11+0.01)-(15.7/(D11+0.01))^2))","v":11.900438780020192},{"$f":"IF(A11=\"\",\"\",G10+(SUM(E$10:E10)-A10)*C10+(A11-SUM(E$10:E10))*C11)","v":32.735951291999996},{"$f":"IF(A11=\"\",\"\",IF(A11<$B$4,G11,G11-(A11-$B$4)*9.807))","v":16.295496491999995},{"$f":"IF(OR(A11<$B$4,A11=\"\"),\"\",LN((G11/H11)/2))","v":4.437940501368893E-3},{"$f":"IF(OR(A11<$B$4,A11=\"\"),\"\",-0.6712-1.126*SIN(A11/11.73+5.133)+(0.0675+0.118*SIN(A11/11.28+5.142))*$B$5)","v":6.8677742983326462E-2},{"$f":"IF(OR(A11=\"\",A11<$B$4),\"\",LN($B$3/1))","v":5.8268908123975824E-2},{"$f":"IF(OR(A11=\"\",$A11<$B$4),\"\",LN(1.0672/(1-LN(H11/101.3)*MIN(0.3,1/(18.9-2.55*SQRT(F11))))))","v":-0.10119802767870599},0.12287849024008908,{"$f":"IF(OR(A11=\"\",A11<$B$4),\"\",I11+J11+K11+L11+M11)","v":0.15306505417005425},{"$f":"IF(Inputs!H14=\"\",1,Inputs!H14)","v":1},{"$f":"IF(OR(N11=\"\",Inputs!J14=\"No\",Method_BI=FALSE),NA(),EXP(LN($B$6/100)+N11))","v":0.40952183783721907},0.15000143450236353,{"$f":"IF(OR(N11=\"\",Inputs!J14=\"No\",Method_BI=FALSE),NA(),Q11/P11)","v":0.36628433612858424},27.375556945800781,{"$f":"IF(OR(N11=\"\",Method_BI=FALSE),NA(),_xlfn.NORM.S.DIST(-LN(R11)/$B$7,TRUE))","v":0.99985596340517657},{"$f":"IF(A11=\"\",\"\",C11*A11)","v":32.735951291999996},31.241364491999995,{"$f":"IF(Inputs!C14=\"\",\"\",IF(Inputs!D14=\"Standard SS (2-in OD)\",Inputs!C14,IF(Inputs!D14=\"Non-Standard (3-in OD)\",Inputs!C14*0.44,IF(Inputs!D14=\"Non-Standard (2.5-in OD)\",Inputs!C14*0.64, IF(Inputs!D14=\"D&M SS (3.25-in OD)\",Inputs!C14*0.3786,IF(Inputs!D14=\"Custom Factor\",Inputs!C14*NFACT))))))","v":6.16},1.7,1.2833333333333334,0.8,1,1,10.751253333333334,null,10.751253333333334,null,null,{"$f":"MIN(1.09+(F11/31.5)^2,2.2)","v":1.2327265741063327},{"$f":"MIN(1.09+(((1.237*(-LN($B$6/100))^4)-(4.918*(-LN($B$6/100))^3)+(1.762*(-LN($B$6/100))^2)-(5.473*(-LN($B$6/100)))+33.65)/31.5)^2,2.2)","v":1.7560412973596036}]
[{"$f":"IF(Inputs!B15=\"\",\"\",IF(units=2,CONVERT(Inputs!B15,\"ft\",\"m\"),Inputs!B15))","v":3.2004000000000001},12.544218221569151,{"$f":"IF(Inputs!E15=\"\",\"\",IF(units=2,Inputs!E15*0.1571,Inputs!E15))","v":19.527529999999999},{"$f":"IF(Inputs!F15=\"\",\"\",Inputs!F15)","v":10},{"$f":"IF(Inputs!G15=\"\",\"\",IF(units=2,CONVERT(Inputs!G15,\"ft\",\"m\"),Inputs!G15))","v":1.524},13.693403668256009,{"$f":"IF(A12=\"\",\"\",G11+(SUM(E$10:E11)-A11)*C11+(A12-SUM(E$10:E11))*C12)","v":62.495907011999996},{"$f":"IF(A12=\"\",\"\",IF(A12<$B$4,G12,G12-(A12-$B$4)*9.807))","v":31.109584211999994},{"$f":"IF(OR(A12<$B$4,A12=\"\"),\"\",LN((G12/H12)/2))","v":4.437940501368893E-3},{"$f":"IF(OR(A12<$B$4,A12=\"\"),\"\",-0.6712-1.126*SIN(A12/11.73+5.133)+(0.0675+0.118*SIN(A12/11.28+5.142))*$B$5)","v":4.7634880394256979E-2},{"$f":"IF(OR(A12=\"\",A12<$B$4),\"\",LN($B$3/1))","v":5.8268908123975824E-2},-5.2518449077439897E-2,0.11139013258480199,0.16921341252696379,{"$f":"IF(Inputs!H15=\"\",1,Inputs!H15)","v":1},{"$f":"IF(OR(N12=\"\",Inputs!J15=\"No\",Method_BI=FALSE),NA(),EXP(LN($B$6/100)+N12))","v":0.4161886272075469},0.165646826340756,{"$f":"IF(OR(N12=\"\",Inputs!J15=\"No\",Method_BI=FALSE),NA(),Q12/P12)","v":0.39800901685415463},27.535186767578125,0.99955936835106585,62.495907011999996,46.055452211999992,{"$f":"IF(Inputs!C15=\"\",\"\",IF(Inputs!D15=\"Standard SS (2-in OD)\",Inputs!C15,IF(Inputs!D15=\"Non-Standard (3-in OD)\",Inputs!C15*0.44,IF(Inputs!D15=\"Non-Standard (2.5-in OD)\",Inputs!C15*0.64, IF(Inputs!D15=\"D&M SS (3.25-in OD)\",Inputs!C15*0.3786,IF(Inputs!D15=\"Custom Factor\",Inputs!C15*NFACT))))))","v":7.68},1.4973522514287088,1.2833333333333334,0.85,1,1,12.544218221569151,null,12.544218221569151,null,null,1.278973851369924,1.7560412973596036]
[{"$f":"IF(Inputs!B16=\"\",\"\",IF(units=2,CONVERT(Inputs!B16,\"ft\",\"m\"),Inputs!B16))","v":4.5720000000000001},1.9867806522050186,{"$f":"IF(Inputs!E16=\"\",\"\",IF(units=2,Inputs!E16*0.1571,Inputs!E16))","v":19.527529999999999},{"$f":"IF(Inputs!F16=\"\",\"\",Inputs!F16)","v":60},{"$f":"IF(Inputs!G16=\"\",\"\",IF(units=2,CONVERT(Inputs!G16,\"ft\",\"m\"),Inputs!G16))","v":1.2192000000000001},7.5891695726420965,{"$f":"IF(A13=\"\",\"\",G12+(SUM(E$10:E12)-A12)*C12+(A13-SUM(E$10:E12))*C13)","v":89.279867159999995},44.442263159999996,4.437940501368893E-3,2.5621229777169116E-2,5.8268908123975824E-2,-2.0404796681832713E-3,0.14426260144550476,0.23055020017983532,{"$f":"IF(Inputs!H16=\"\",1,Inputs!H16)","v":1},{"$f":"IF(OR(N13=\"\",Inputs!J16=\"No\",Method_BI=FALSE),NA(),EXP(LN($B$6/100)+N13))","v":{"$error":"#N/A"}},0.11608672878067261,{"$f":"IF(OR(N13=\"\",Inputs!J16=\"No\",Method_BI=FALSE),NA(),Q13/P13)","v":{"$error":"#N/A"}},{"$error":"#N/A"},{"$error":"#N/A"},89.279867159999995,59.388131159999993,{"$f":"IF(Inputs!C16=\"\",\"\",IF(Inputs!D16=\"Standard SS (2-in OD)\",Inputs!C16,IF(Inputs!D16=\"Non-Standard (3-in OD)\",Inputs!C16*0.44,IF(Inputs!D16=\"Non-Standard (2.5-in OD)\",Inputs!C16*0.64, IF(Inputs!D16=\"D&M SS (3.25-in OD)\",Inputs!C16*0.3786,IF(Inputs!D16=\"Custom Factor\",Inputs!C16*NFACT))))))","v":1.1357999999999999},1.4347788880102712,1.2833333333333334,0.95,1,1,1.9867806522050186,null,1.9867806522050186,null,null,1.148045346235643,1.7560412973596036]
[{"$f":"IF(Inputs!B17=\"\",\"\",IF(units=2,CONVERT(Inputs!B17,\"ft\",\"m\"),Inputs!B17))","v":6.2484000000000002},20.559288464609821,{"$f":"IF(Inputs!E17=\"\",\"\",IF(units=2,Inputs!E17*0.1571,Inputs!E17))","v":19.527529999999999},{"$f":"IF(Inputs!F17=\"\",\"\",Inputs!F17)","v":10},{"$f":"IF(Inputs!G17=\"\",\"\",IF(units=2,CONVERT(Inputs!G17,\"ft\",\"m\"),Inputs!G17))","v":2.1335999999999999},21.708473911296679,{"$f":"IF(A14=\"\",\"\",G13+(SUM(E$10:E13)-A13)*C13+(A14-SUM(E$10:E13))*C14)","v":122.01581845199999},60.737759651999987,4.437940501368893E-3,-4.899474666077647E-3,5.8268908123975824E-2,-5.3055385908838282E-3,4.3142444541667352E-2,9.5644279910050589E-2,{"$f":"IF(Inputs!H17=\"\",1,Inputs!H17)","v":1},{"$f":"IF(OR(N14=\"\",Inputs!J17=\"No\",Method_BI=FALSE),NA(),EXP(LN($B$6/100)+N14))","v":0.38666916463062412},0.26042037964772907,{"$f":"IF(OR(N14=\"\",Inputs!J17=\"No\",Method_BI=FALSE),NA(),Q14/P14)","v":0.67349663088987843},26.788627624511719,0.9232065591434705,122.01581845199999,75.683627651999984,{"$f":"IF(Inputs!C17=\"\",\"\",IF(Inputs!D17=\"Standard SS (2-in OD)\",Inputs!C17,IF(Inputs!D17=\"Non-Standard (3-in OD)\",Inputs!C17*0.44,IF(Inputs!D17=\"Non-Standard (2.5-in OD)\",Inputs!C17*0.64, IF(Inputs!D17=\"D&M SS (3.25-in OD)\",Inputs!C17*0.3786,IF(Inputs!D17=\"Custom Factor\",Inputs!C17*NFACT))))))","v":14.850000000000001},1.1355821213976993,1.2833333333333334,0.95,1,1,20.559288464609821,null,20.559288464609821,null,null,1.5649386138145109,1.7560412973596036]
[{"$f":"IF(Inputs!B18=\"\",\"\",IF(units=2,CONVERT(Inputs!B18,\"ft\",\"m\"),Inputs!B18))","v":7.7724000000000002},27.991214213602863,{"$f":"IF(Inputs!E18=\"\",\"\",IF(units=2,Inputs!E18*0.1571,Inputs!E18))","v":19.527529999999999},{"$f":"IF(Inputs!F18=\"\",\"\",Inputs!F18)","v":10},{"$f":"IF(Inputs!G18=\"\",\"\",IF(units=2,CONVERT(Inputs!G18,\"ft\",\"m\"),Inputs!G18))","v":0.91439999999999999},29.14039966028972,{"$f":"IF(A15=\"\",\"\",G14+(SUM(E$10:E14)-A14)*C14+(A15-SUM(E$10:E14))*C15)","v":151.77577417199998},75.551847371999983,4.437940501368893E-3,-3.5726573997519454E-2,5.8268908123975824E-2,9.4943521315807595E-3,-4.1071934457502499E-2,-4.5973076980964783E-3,{"$f":"IF(Inputs!H18=\"\",1,Inputs!H18)","v":1},{"$f":"IF(OR(N15=\"\",Inputs!J18=\"No\",Method_BI=FALSE),NA(),EXP(LN($B$6/100)+N15))","v":0.34978821385211095},0.49659069667537709,{"$f":"IF(OR(N15=\"\",Inputs!J18=\"No\",Method_BI=FALSE),NA(),Q15/P15)","v":1.4196896207753118},25.683929443359375,0.10291413729989128,151.77577417199998,90.497715371999988,{"$f":"IF(Inputs!C18=\"\",\"\",IF(Inputs!D18=\"Standard SS (2-in OD)\",Inputs!C18,IF(Inputs!D18=\"Non-Standard (3-in OD)\",Inputs!C18*0.44,IF(Inputs!D18=\"Non-Standard (2.5-in OD)\",Inputs!C18*0.64, IF(Inputs!D18=\"D&M SS (3.25-in OD)\",Inputs!C18*0.3786,IF(Inputs!D18=\"Custom Factor\",Inputs!C18*NFACT))))))","v":22},1.0436045813808312,1.2833333333333334,0.95,1,1,27.991214213602863,null,27.991214213602863,null,null,1.9457953059827799,1.7560412973596036]
[{"$f":"IF(Inputs!B19=\"\",\"\",IF(units=2,CONVERT(Inputs!B19,\"ft\",\"m\"),Inputs!B19))","v":9.2964000000000002},20.1884451292024,{"$f":"IF(Inputs!E19=\"\",\"\",IF(units=2,Inputs!E19*0.1571,Inputs!E19))","v":19.527529999999999},{"$f":"IF(Inputs!F19=\"\",\"\",Inputs!F19)","v":10},{"$f":"IF(Inputs!G19=\"\",\"\",IF(units=2,CONVERT(Inputs!G19,\"ft\",\"m\"),Inputs!G19))","v":2.1335999999999999},21.337630575889257,{"$f":"IF(A16=\"\",\"\",G15+(SUM(E$10:E15)-A15)*C15+(A16-SUM(E$10:E15))*C16)","v":181.53572989199998},90.365935091999972,4.437940501368893E-3,-6.9084466379528447E-2,5.8268908123975824E-2,4.9125634732985757E-2,4.6860794937381808E-2,8.9608811916183834E-2,{"$f":"IF(Inputs!H19=\"\",1,Inputs!H19)","v":1},{"$f":"IF(OR(N16=\"\",Inputs!J19=\"No\",Method_BI=FALSE),NA(),EXP(LN($B$6/100)+N16))","v":0.38434246369067387},0.25433828936835712,{"$f":"IF(OR(N16=\"\",Inputs!J19=\"No\",Method_BI=FALSE),NA(),Q16/P16)","v":0.66174912583443657},26.725074768066406,0.93195371453592901,181.53572989200001,105.31180309200001,{"$f":"IF(Inputs!C19=\"\",\"\",IF(Inputs!D19=\"Standard SS (2-in OD)\",Inputs!C19,IF(Inputs!D19=\"Non-Standard (3-in OD)\",Inputs!C19*0.44,IF(Inputs!D19=\"Non-Standard (2.5-in OD)\",Inputs!C19*0.64, IF(Inputs!D19=\"D&M SS (3.25-in OD)\",Inputs!C19*0.3786,IF(Inputs!D19=\"Custom Factor\",Inputs!C19*NFACT))))))","v":16},0.98320349655206485,1.2833333333333334,1,1,1,20.1884451292024,null,20.1884451292024,null,null,1.5488505705146125,1.7560412973596036]
[{"$f":"IF(Inputs!B20=\"\",\"\",IF(units=2,CONVERT(Inputs!B20,\"ft\",\"m\"),Inputs!B20))","v":10.820399999999999},8.3384535645198135,{"$f":"IF(Inputs!E20=\"\",\"\",IF(units=2,Inputs!E20*0.1571,Inputs!E20))","v":19.527529999999999},{"$f":"IF(Inputs!F20=\"\",\"\",Inputs!F20)","v":10},{"$f":"IF(Inputs!G20=\"\",\"\",IF(units=2,CONVERT(Inputs!G20,\"ft\",\"m\"),Inputs!G20))","v":0.91439999999999999},9.4876390112066709,{"$f":"IF(A17=\"\",\"\",G16+(SUM(E$10:E16)-A16)*C16+(A17-SUM(E$10:E16))*C17)","v":211.29568561199994},105.18002281199995,4.4379405013691142E-3,-0.10454778640876689,5.8268908123975824E-2,6.8447125165137457E-2,0.13595758709669648,0.16256377447841197,{"$f":"IF(Inputs!H20=\"\",1,Inputs!H20)","v":1},{"$f":"IF(OR(N17=\"\",Inputs!J20=\"No\",Method_BI=FALSE),NA(),EXP(LN($B$6/100)+N17))","v":0.41343030456417246},0.1304252794205025,{"$f":"IF(OR(N17=\"\",Inputs!J20=\"No\",Method_BI=FALSE),NA(),Q17/P17)","v":0.31547101888912921},27.469764709472656,0.99998442829659551,211.29568561199997,120.12589081199998,{"$f":"IF(Inputs!C20=\"\",\"\",IF(Inputs!D20=\"Standard SS (2-in OD)\",Inputs!C20,IF(Inputs!D20=\"Non-Standard (3-in OD)\",Inputs!C20*0.44,IF(Inputs!D20=\"Non-Standard (2.5-in OD)\",Inputs!C20*0.64, IF(Inputs!D20=\"D&M SS (3.25-in OD)\",Inputs!C20*0.3786,IF(Inputs!D20=\"Custom Factor\",Inputs!C20*NFACT))))))","v":7.15},0.90874073902677099,1.2833333333333334,1,1,1,8.3384535645198135,null,8.3384535645198135,null,null,1.1807183613071008,1.7560412973596036]
[{"$f":"IF(Inputs!B21=\"\",\"\",IF(units=2,CONVERT(Inputs!B21,\"ft\",\"m\"),Inputs!B21))","v":12.4968},1.7282171422467403,{"$f":"IF(Inputs!E21=\"\",\"\",IF(units=2,Inputs!E21*0.1571,Inputs!E21))","v":19.527529999999999},{"$f":"IF(Inputs!F21=\"\",\"\",Inputs!F21)","v":70},{"$f":"IF(Inputs!G21=\"\",\"\",IF(units=2,CONVERT(Inputs!G21,\"ft\",\"m\"),Inputs!G21))","v":2.4384000000000001},7.3030476983682764,{"$f":"IF(A18=\"\",\"\",G17+(SUM(E$10:E17)-A17)*C17+(A18-SUM(E$10:E17))*C18)","v":244.03163690399998},121.47551930399997,4.437940501368893E-3,-0.14544584570084784,5.8268908123975824E-2,8.0278321503067462E-2,0.14535928990064534,0.14289861432820966,{"$f":"IF(Inputs!H21=\"\",1,Inputs!H21)","v":1},{"$f":"IF(OR(N18=\"\",Inputs!J21=\"No\",Method_BI=FALSE),NA(),EXP(LN($B$6/100)+N18))","v":{"$error":"#N/A"}},0.11400729285551024,{"$f":"IF(OR(N18=\"\",Inputs!J21=\"No\",Method_BI=FALSE),NA(),Q18/P18)","v":{"$error":"#N/A"}},{"$error":"#N/A"},{"$error":"#N/A"},244.03163690399998,136.42138730399998,{"$f":"IF(Inputs!C21=\"\",\"\",IF(Inputs!D21=\"Standard SS (2-in OD)\",Inputs!C21,IF(Inputs!D21=\"Non-Standard (3-in OD)\",Inputs!C21*0.44,IF(Inputs!D21=\"Non-Standard (2.5-in OD)\",Inputs!C21*0.64, IF(Inputs!D21=\"D&M SS (3.25-in OD)\",Inputs!C21*0.3786,IF(Inputs!D21=\"Custom Factor\",Inputs!C21*NFACT))))))","v":1.6500000000000001},0.81615921711770478,1.2833333333333334,1,1,1,1.7282171422467403,null,1.7282171422467403,null,null,1.1437510765277321,1.7560412973596036]
[{"$f":"IF(Inputs!B22=\"\",\"\",IF(units=2,CONVERT(Inputs!B22,\"ft\",\"m\"),Inputs!B22))","v":13.715999999999999},1.6308342079976466,{"$f":"IF(Inputs!E22=\"\",\"\",IF(units=2,Inputs!E22*0.1571,Inputs!E22))","v":19.527529999999999},{"$f":"IF(Inputs!F22=\"\",\"\",Inputs!F22)","v":5},{"$f":"IF(Inputs!G22=\"\",\"\",IF(units=2,CONVERT(Inputs!G22,\"ft\",\"m\"),Inputs!G22))","v":0.91439999999999999},1.6327566637818389,{"$f":"IF(A19=\"\",\"\",G18+(SUM(E$10:E18)-A18)*C18+(A19-SUM(E$10:E18))*C19)","v":267.83960147999994},133.32678947999995,4.437940501368893E-3,-0.17608065919922811,5.8268908123975824E-2,8.2757643493507713E-2,0.15849334748747554,0.12787718040709986,{"$f":"IF(Inputs!H22=\"\",1,Inputs!H22)","v":1},{"$f":"IF(OR(N19=\"\",Inputs!J22=\"No\",Method_BI=FALSE),NA(),EXP(LN($B$6/100)+N19))","v":0.3993356758905604},7.774291842473656E-2,{"$f":"IF(OR(N19=\"\",Inputs!J22=\"No\",Method_BI=FALSE),NA(),Q19/P19)","v":0.19468062364165611},27.121719360351563,0.9999999982639699,267.83960147999994,148.27265747999994,{"$f":"IF(Inputs!C22=\"\",\"\",IF(Inputs!D22=\"Standard SS (2-in OD)\",Inputs!C22,IF(Inputs!D22=\"Non-Standard (3-in OD)\",Inputs!C22*0.44,IF(Inputs!D22=\"Non-Standard (2.5-in OD)\",Inputs!C22*0.64, IF(Inputs!D22=\"D&M SS (3.25-in OD)\",Inputs!C22*0.3786,IF(Inputs!D22=\"Custom Factor\",Inputs!C22*NFACT))))))","v":1.6500000000000001},0.77016963777928993,1.2833333333333334,1,1,1,1.6308342079976466,null,1.6308342079976466,null,null,1.0926867163750307,1.7560412973596036]
[{"$f":"IF(Inputs!B23=\"\",\"\",IF(units=2,CONVERT(Inputs!B23,\"ft\",\"m\"),Inputs!B23))","v":15.6972},9.6579991118717725,{"$f":"IF(Inputs!E23=\"\",\"\",IF(units=2,Inputs!E23*0.1571,Inputs!E23))","v":19.527529999999999},{"$f":"IF(Inputs!F23=\"\",\"\",Inputs!F23)","v":5},{"$f":"IF(Inputs!G23=\"\",\"\",IF(units=2,CONVERT(Inputs!G23,\"ft\",\"m\"),Inputs!G23))","v":2.1335999999999999},9.6599215676559655,{"$f":"IF(A20=\"\",\"\",G19+(SUM(E$10:E19)-A19)*C19+(A20-SUM(E$10:E19))*C20)","v":306.52754391599996},152.58510351599995,4.437940501368893E-3,-0.22673642204297573,5.8268908123975824E-2,0.1030790457705245,0.13511638569831622,7.416585805120969E-2,{"$f":"IF(Inputs!H23=\"\",1,Inputs!H23)","v":1},{"$f":"IF(OR(N20=\"\",Inputs!J23=\"No\",Method_BI=FALSE),NA(),EXP(LN($B$6/100)+N20))","v":0.37845267566951402},0.13177233281099929,{"$f":"IF(OR(N20=\"\",Inputs!J23=\"No\",Method_BI=FALSE),NA(),Q20/P20)","v":0.34818708198556969},26.560958862304688,0.99993015589541978,306.52754391600001,167.53097151599999,{"$f":"IF(Inputs!C23=\"\",\"\",IF(Inputs!D23=\"Standard SS (2-in OD)\",Inputs!C23,IF(Inputs!D23=\"Non-Standard (3-in OD)\",Inputs!C23*0.44,IF(Inputs!D23=\"Non-Standard (2.5-in OD)\",Inputs!C23*0.64, IF(Inputs!D23=\"D&M SS (3.25-in OD)\",Inputs!C23*0.3786,IF(Inputs!D23=\"Custom Factor\",Inputs!C23*NFACT))))))","v":9.9},0.76017309026932478,1.2833333333333334,1,1,1,9.6579991118717725,null,9.6579991118717725,null,null,1.1840429173023583,1.7560412973596036]
[{"$f":"IF(Inputs!B24=\"\",\"\",IF(units=2,CONVERT(Inputs!B24,\"ft\",\"m\"),Inputs!B24))","v":17.3736},2.3739365564012611,{"$f":"IF(Inputs!E24=\"\",\"\",IF(units=2,Inputs!E24*0.1571,Inputs!E24))","v":19.527529999999999},{"$f":"IF(Inputs!F24=\"\",\"\",Inputs!F24)","v":5},{"$f":"IF(Inputs!G24=\"\",\"\",IF(units=2,CONVERT(Inputs!G24,\"ft\",\"m\"),Inputs!G24))","v":1.2192000000000001},2.3758590121854533,{"$f":"IF(A21=\"\",\"\",G20+(SUM(E$10:E20)-A20)*C20+(A21-SUM(E$10:E20))*C21)","v":339.26349520799994},168.88060000799993,4.4379405013691142E-3,-0.26972363572947755,5.8268908123975824E-2,9.9778074875119818E-2,0.15771640406878201,5.0477691839769259E-2,{"$f":"IF(Inputs!H24=\"\",1,Inputs!H24)","v":1},{"$f":"IF(OR(N21=\"\",Inputs!J24=\"No\",Method_BI=FALSE),NA(),EXP(LN($B$6/100)+N21))","v":0.36959317274726489},8.1913820303973858E-2,{"$f":"IF(OR(N21=\"\",Inputs!J24=\"No\",Method_BI=FALSE),NA(),Q21/P21)","v":0.22163239568277454},26.304130554199219,0.99999997328140511,339.26349520799999,183.82646800800001,{"$f":"IF(Inputs!C24=\"\",\"\",IF(Inputs!D24=\"Standard SS (2-in OD)\",Inputs!C24,IF(Inputs!D24=\"Non-Standard (3-in OD)\",Inputs!C24*0.44,IF(Inputs!D24=\"Non-Standard (2.5-in OD)\",Inputs!C24*0.64, IF(Inputs!D24=\"D&M SS (3.25-in OD)\",Inputs!C24*0.3786,IF(Inputs!D24=\"Custom Factor\",Inputs!C24*NFACT))))))","v":2.75},0.67266207029079417,1.2833333333333334,1,1,1,2.3739365564012611,null,2.3739365564012611,null,null,1.0956887942008395,1.7560412973596036]
[{"$f":"IF(Inputs!B25=\"\",\"\",IF(units=2,CONVERT(Inputs!B25,\"ft\",\"m\"),Inputs!B25))","v":""},"",{"$f":"IF(Inputs!E25=\"\",\"\",IF(units=2,Inputs!E25*0.1571,Inputs!E25))","v":""},{"$f":"IF(Inputs!F25=\"\",\"\",Inputs!F25)","v":""},{"$f":"IF(Inputs!G25=\"\",\"\",IF(units=2,CONVERT(Inputs!G25,\"ft\",\"m\"),Inputs!G25))","v":""},{"$error":"#N/A"},{"$f":"IF(A22=\"\",\"\",G21+(SUM(E$10:E21)-A21)*C21+(A22-SUM(E$10:E21))*C22)","v":""},"","","","","","","",{"$f":"IF(Inputs!H25=\"\",1,Inputs!H25)","v":1},{"$f":"IF(OR(N22=\"\",Inputs!J25=\"No\",Method_BI=FALSE),NA(),EXP(LN($B$6/100)+N22))","v":{"$error":"#N/A"}},{"$error":"#N/A"},{"$f":"IF(OR(N22=\"\",Inputs!J25=\"No\",Method_BI=FALSE),NA(),Q22/P22)","v":{"$error":"#N/A"}},{"$error":"#N/A"},{"$error":"#N/A"},"","",{"$f":"IF(Inputs!C25=\"\",\"\",IF(Inputs!D25=\"Standard SS (2-in OD)\",Inputs!C25,IF(Inputs!D25=\"Non-Standard (3-in OD)\",Inputs!C25*0.44,IF(Inputs!D25=\"Non-Standard (2.5-in OD)\",Inputs!C25*0.64, IF(Inputs!D25=\"D&M SS (3.25-in OD)\",Inputs!C25*0.3786,IF(Inputs!D25=\"Custom Factor\",Inputs!C25*NFACT))))))","v":""},"","","","","","",null,"",null,null,{"$error":"#N/A"},1.7560412973596036]
[{"$f":"IF(Inputs!B26=\"\",\"\",IF(units=2,CONVERT(Inputs!B26,\"ft\",\"m\"),Inputs!B26))","v":""},"",{"$f":"IF(Inputs!E26=\"\",\"\",IF(units=2,Inputs!E26*0.1571,Inputs!E26))","v":""},{"$f":"IF(Inputs!F26=\"\",\"\",Inputs!F26)","v":""},{"$f":"IF(Inputs!G26=\"\",\"\",IF(units=2,CONVERT(Inputs!G26,\"ft\",\"m\"),Inputs!G26))","v":""},{"$error":"#N/A"},{"$f":"IF(A23=\"\",\"\",G22+(SUM(E$10:E22)-A22)*C22+(A23-SUM(E$10:E22))*C23)","v":""},"","","","","","","",{"$f":"IF(Inputs!H26=\"\",1,Inputs!H26)","v":1},{"$f":"IF(OR(N23=\"\",Inputs!J26=\"No\",Method_BI=FALSE),NA(),EXP(LN($B$6/100)+N23))","v":{"$error":"#N/A"}},{"$error":"#N/A"},{"$f":"IF(OR(N23=\"\",Inputs!J26=\"No\",Method_BI=FALSE),NA(),Q23/P23)","v":{"$error":"#N/A"}},{"$error":"#N/A"},{"$error":"#N/A"},"","",{"$f":"IF(Inputs!C26=\"\",\"\",IF(Inputs!D26=\"Standard SS (2-in OD)\",Inputs!C26,IF(Inputs!D26=\"Non-Standard (3-in OD)\",Inputs!C26*0.44,IF(Inputs!D26=\"Non-Standard (2.5-in OD)\",Inputs!C26*0.64, IF(Inputs!D26=\"D&M SS (3.25-in OD)\",Inputs!C26*0.3786,IF(Inputs!D26=\"Custom Factor\",Inputs!C26*NFACT))))))","v":""},"","","","","","",null,"",null,null,{"$error":"#N/A"},1.7560412973596036]
[{"$f":"IF(Inputs!B27=\"\",\"\",IF(units=2,CONVERT(Inputs!B27,\"ft\",\"m\"),Inputs!B27))","v":""},"",{"$f":"IF(Inputs!E27=\"\",\"\",IF(units=2,Inputs!E27*0.1571,Inputs!E27))","v":""},{"$f":"IF(Inputs!F27=\"\",\"\",Inputs!F27)","v":""},{"$f":"IF(Inputs!G27=\"\",\"\",IF(units=2,CONVERT(Inputs!G27,\"ft\",\"m\"),Inputs!G27))","v":""},{"$error":"#N/A"},{"$f":"IF(A24=\"\",\"\",G23+(SUM(E$10:E23)-A23)*C23+(A24-SUM(E$10:E23))*C24)","v":""},"","","","","","","",{"$f":"IF(Inputs!H27=\"\",1,Inputs!H27)","v":1},{"$f":"IF(OR(N24=\"\",Inputs!J27=\"No\",Method_BI=FALSE),NA(),EXP(LN($B$6/100)+N24))","v":{"$error":"#N/A"}},{"$error":"#N/A"},{"$f":"IF(OR(N24=\"\",Inputs!J27=\"No\",Method_BI=FALSE),NA(),Q24/P24)","v":{"$error":"#N/A"}},{"$error":"#N/A"},{"$error":"#N/A"},"","",{"$f":"IF(Inputs!C27=\"\",\"\",IF(Inputs!D27=\"Standard SS (2-in OD)\",Inputs!C27,IF(Inputs!D27=\"Non-Standard (3-in OD)\",Inputs!C27*0.44,IF(Inputs!D27=\"Non-Standard (2.5-in OD)\",Inputs!C27*0.64, IF(Inputs!D27=\"D&M SS (3.25-in OD)\",Inputs!C27*0.3786,IF(Inputs!D27=\"Custom Factor\",Inputs!C27*NFACT))))))","v":""},"","","","","","",null,"",null,null,{"$error":"#N/A"},1.7560412973596036]
[{"$f":"IF(Inputs!B28=\"\",\"\",IF(units=2,CONVERT(Inputs!B28,\"ft\",\"m\"),Inputs!B28))","v":""},"",{"$f":"IF(Inputs!E28=\"\",\"\",IF(units=2,Inputs!E28*0.1571,Inputs!E28))","v":""},{"$f":"IF(Inputs!F28=\"\",\"\",Inputs!F28)","v":""},{"$f":"IF(Inputs!G28=\"\",\"\",IF(units=2,CONVERT(Inputs!G28,\"ft\",\"m\"),Inputs!G28))","v":""},{"$error":"#N/A"},{"$f":"IF(A25=\"\",\"\",G24+(SUM(E$10:E24)-A24)*C24+(A25-SUM(E$10:E24))*C25)","v":""},"","","","","","","",{"$f":"IF(Inputs!H28=\"\",1,Inputs!H28)","v":1},{"$f":"IF(OR(N25=\"\",Inputs!J28=\"No\",Method_BI=FALSE),NA(),EXP(LN($B$6/100)+N25))","v":{"$error":"#N/A"}},{"$error":"#N/A"},{"$f":"IF(OR(N25=\"\",Inputs!J28=\"No\",Method_BI=FALSE),NA(),Q25/P25)","v":{"$error":"#N/A"}},{"$error":"#N/A"},{"$error":"#N/A"},"","",{"$f":"IF(Inputs!C28=\"\",\"\",IF(Inputs!D28=\"Standard SS (2-in OD)\",Inputs!C28,IF(Inputs!D28=\"Non-Standard (3-in OD)\",Inputs!C28*0.44,IF(Inputs!D28=\"Non-Standard (2.5-in OD)\",Inputs!C28*0.64, IF(Inputs!D28=\"D&M SS (3.25-in OD)\",Inputs!C28*0.3786,IF(Inputs!D28=\"Custom Factor\",Inputs!C28*NFACT))))))","v":""},"","","","","","",null,"",null,null,{"$error":"#N/A"},1.7560412973596036]
[{"$f":"IF(Inputs!B29=\"\",\"\",IF(units=2,CONVERT(Inputs!B29,\"ft\",\"m\"),Inputs!B29))","v":""},"",{"$f":"IF(Inputs!E29=\"\",\"\",IF(units=2,Inputs!E29*0.1571,Inputs!E29))","v":""},{"$f":"IF(Inputs!F29=\"\",\"\",Inputs!F29)","v":""},{"$f":"IF(Inputs!G29=\"\",\"\",IF(units=2,CONVERT(Inputs!G29,\"ft\",\"m\"),Inputs!G29))","v":""},{"$error":"#N/A"},{"$f":"IF(A26=\"\",\"\",G25+(SUM(E$10:E25)-A25)*C25+(A26-SUM(E$10:E25))*C26)","v":""},"","","","","","","",{"$f":"IF(Inputs!H29=\"\",1,Inputs!H29)","v":1},{"$f":"IF(OR(N26=\"\",Inputs!J29=\"No\",Method_BI=FALSE),NA(),EXP(LN($B$6/100)+N26))","v":{"$error":"#N/A"}},{"$error":"#N/A"},{"$f":"IF(OR(N26=\"\",Inputs!J29=\"No\",Method_BI=FALSE),NA(),Q26/P26)","v":{"$error":"#N/A"}},{"$error":"#N/A"},{"$error":"#N/A"},"","",{"$f":"IF(Inputs!C29=\"\",\"\",IF(Inputs!D29=\"Standard SS (2-in OD)\",Inputs!C29,IF(Inputs!D29=\"Non-Standard (3-in OD)\",Inputs!C29*0.44,IF(Inputs!D29=\"Non-Standard (2.5-in OD)\",Inputs!C29*0.64, IF(Inputs!D29=\"D&M SS (3.25-in OD)\",Inputs!C29*0.3786,IF(Inputs!D29=\"Custom Factor\",Inputs!C29*NFACT))))))","v":""},"","","","","","",null,"",null,null,{"$error":"#N/A"},1.7560412973596036]
[{"$f":"IF(Inputs!B30=\"\",\"\",IF(units=2,CONVERT(Inputs!B30,\"ft\",\"m\"),Inputs!B30))","v":""},"",{"$f":"IF(Inputs!E30=\"\",\"\",IF(units=2,Inputs!E30*0.1571,Inputs!E30))","v":""},{"$f":"IF(Inputs!F30=\"\",\"\",Inputs!F30)","v":""},{"$f":"IF(Inputs!G30=\"\",\"\",IF(units=2,CONVERT(Inputs!G30,\"ft\",\"m\"),Inputs!G30))","v":""},{"$error":"#N/A"},{"$f":"IF(A27=\"\",\"\",G26+(SUM(E$10:E26)-A26)*C26+(A27-SUM(E$10:E26))*C27)","v":""},"","","","","","","",{"$f":"IF(Inputs!H30=\"\",1,Inputs!H30)","v":1},{"$f":"IF(OR(N27=\"\",Inputs!J30=\"No\",Method_BI=FALSE),NA(),EXP(LN($B$6/100)+N27))","v":{"$error":"#N/A"}},{"$error":"#N/A"},{"$f":"IF(OR(N27=\"\",Inputs!J30=\"No\",Method_BI=FALSE),NA(),Q27/P27)","v":{"$error":"#N/A"}},{"$error":"#N/A"},{"$error":"#N/A"},"","",{"$f":"IF(Inputs!C30=\"\",\"\",IF(Inputs!D30=\"Standard SS (2-in OD)\",Inputs!C30,IF(Inputs!D30=\"Non-Standard (3-in OD)\",Inputs!C30*0.44,IF(Inputs!D30=\"Non-Standard (2.5-in OD)\",Inputs!C30*0.64, IF(Inputs!D30=\"D&M SS (3.25-in OD)\",Inputs!C30*0.3786,IF(Inputs!D30=\"Custom Factor\",Inputs!C30*NFACT))))))","v":""},"","","","","","",null,"",null,null,{"$error":"#N/A"},1.7560412973596036]
[{"$f":"IF(Inputs!B31=\"\",\"\",IF(units=2,CONVERT(Inputs!B31,\"ft\",\"m\"),Inputs!B31))","v":""},"",{"$f":"IF(Inputs!E31=\"\",\"\",IF(units=2,Inputs!E31*0.1571,Inputs!E31))","v":""},{"$f":"IF(Inputs!F31=\"\",\"\",Inputs!F31)","v":""},{"$f":"IF(Inputs!G31=\"\",\"\",IF(units=2,CONVERT(Inputs!G31,\"ft\",\"m\"),Inputs!G31))","v":""},{"$error":"#N/A"},{"$f":"IF(A28=\"\",\"\",G27+(SUM(E$10:E27)-A27)*C27+(A28-SUM(E$10:E27))*C28)","v":""},"",{"$f":"IF(OR(A28<$B$4,A28=\"\"),\"\",LN((G28/H28)/2))","v":""},{"$f":"IF(OR(A28<$B$4,A28=\"\"),\"\",-0.6712-1.126*SIN(A28/11.73+5.133)+(0.0675+0.118*SIN(A28/11.28+5.142))*$B$5)","v":""},{"$f":"IF(OR(A28=\"\",A28<$B$4),\"\",LN($B$3/1))","v":""},"","","",{"$f":"IF(Inputs!H31=\"\",1,Inputs!H31)","v":1},{"$f":"IF(OR(N28=\"\",Inputs!J31=\"No\",Method_BI=FALSE),NA(),EXP(LN($B$6/100)+N28))","v":{"$error":"#N/A"}},{"$error":"#N/A"},{"$f":"IF(OR(N28=\"\",Inputs!J31=\"No\",Method_BI=FALSE),NA(),Q28/P28)","v":{"$error":"#N/A"}},{"$error":"#N/A"},{"$error":"#N/A"},"","",{"$f":"IF(Inputs!C31=\"\",\"\",IF(Inputs!D31=\"Standard SS (2-in OD)\",Inputs!C31,IF(Inputs!D31=\"Non-Standard (3-in OD)\",Inputs!C31*0.44,IF(Inputs!D31=\"Non-Standard (2.5-in OD)\",Inputs!C31*0.64, IF(Inputs!D31=\"D&M SS (3.25-in OD)\",Inputs!C31*0.3786,IF(Inputs!D31=\"Custom Factor\",Inputs!C31*NFACT))))))","v":""},"","","","","","",null,""]
[{"$f":"IF(Inputs!B32=\"\",\"\",IF(units=2,CONVERT(Inputs!B32,\"ft\",\"m\"),Inputs!B32))","v":""},{"$f":"IF(AC29=\"\",\"\",AC29)","v":""},{"$f":"IF(Inputs!E32=\"\",\"\",IF(units=2,Inputs!E32*0.1571,Inputs!E32))","v":""},{"$f":"IF(Inputs!F32=\"\",\"\",Inputs!F32)","v":""},{"$f":"IF(Inputs!G32=\"\",\"\",IF(units=2,CONVERT(Inputs!G32,\"ft\",\"m\"),Inputs!G32))","v":""},{"$error":"#N/A"},{"$f":"IF(A29=\"\",\"\",G28+(SUM(E$10:E28)-A28)*C28+(A29-SUM(E$10:E28))*C29)","v":""},"",{"$f":"IF(OR(A29<$B$4,A29=\"\"),\"\",LN((G29/H29)/2))","v":""},{"$f":"IF(OR(A29<$B$4,A29=\"\"),\"\",-0.6712-1.126*SIN(A29/11.73+5.133)+(0.0675+0.118*SIN(A29/11.28+5.142))*$B$5)","v":""},{"$f":"IF(OR(A29=\"\",A29<$B$4),\"\",LN($B$3/1))","v":""},"","","",{"$f":"IF(Inputs!H32=\"\",1,Inputs!H32)","v":1},{"$f":"IF(OR(N29=\"\",Inputs!J32=\"No\",Method_BI=FALSE),NA(),EXP(LN($B$6/100)+N29))","v":{"$error":"#N/A"}},{"$error":"#N/A"},{"$f":"IF(OR(N29=\"\",Inputs!J32=\"No\",Method_BI=FALSE),NA(),Q29/P29)","v":{"$error":"#N/A"}},{"$error":"#N/A"},{"$error":"#N/A"},"","",{"$f":"IF(Inputs!C32=\"\",\"\",IF(Inputs!D32=\"Standard SS (2-in OD)\",Inputs!C32,IF(Inputs!D32=\"Non-Standard (3-in OD)\",Inputs!C32*0.44,IF(Inputs!D32=\"Non-Standard (2.5-in OD)\",Inputs!C32*0.64, IF(Inputs!D32=\"D&M SS (3.25-in OD)\",Inputs!C32*0.3786,IF(Inputs!D32=\"Custom Factor\",Inputs!C32*NFACT))))))","v":""},"","","","","","",null,""]
[null,null,null,null,null,null,null,null,null,null,null,null,null,null,null,null,null,1,1]
[]
[]
[]
["Simplified Performance-based Liquefaction Triggering using Cetin et al. (2004), after Mayfield et al. (2010)",null,null,null,null,null,null,null,null,null,null,null,null,null,null,null,null,null,null,null,null,null,"Cetin et. al (2004) (N1)60 Corrections"]
[]
["PGA:",{"$f":"B2","v":0.44},"g"]
["Fpga:",{"$f":"B3","v":1.06}]
["Depth to Water:",{"$f":"B4","v":0},"m"]
["Vs,12:",{"$f":"IF(Inputs!C39=\"\",NA(),IF(units=1,Inputs!C39,CONVERT(Inputs!C39,\"ft\",\"m\")))","v":189.8904},"m/s"]
["Nreq:",{"$f":"IF(Inputs!$C$51=\"\",NA(),Inputs!$C$51)","v":49.09}]
["Mw:",{"$f":"B5","v":6.77}]
["Depth:","(N1)60","Fines (%)","(N1)60,cs","DNs","DNrd","DNF","DNreq","KDR(aging)","Nreqsite","FSL","PL","CSR(site)","CRR",null,null,null,null,null,null,null,null,"SPT N","sv' (kPa)","CN","N1","CE","CR","CB","CS","(N1)60",null,"(N1)60 (copy)",null,null,null,null,null,null,null,"C_R (EQ)","C_R (EST)",null,"Rod L (m)"]
[{"$f":"IF(A10=\"\",\"\",A10)","v":0.4572},{"$f":"IF(A43=\"\",\"\",AE43)","v":30.800000000000004},{"$f":"IF(D10=\"\",\"\",D10)","v":10},{"$f":"IF(OR(A43=\"\",Method_Cetin=FALSE),NA(),IF(C43<5,B43,IF(C43>35,B43*(1+0.004*35)+0.06*35,B43*(1+0.004*C43)+0.06*C43)))","v":32.632000000000005},{"$f":"IF(OR(A43<$B$38,A43=\"\"),\"\",13.79*LN((1-0.2*$B$4/A43)/(1+0.6*$B$4/A43))+3.82*LN(A43/6*(1+0.6*$B$4/A43)))","v":-9.8341843782260288},{"$f":"IF(OR(A43<$B$38,A43=\"\"),\"\",13.79*(LN(((-1.412+0.0525*$B$39+2.671*EXP(0.0268*$B$39-0.341*A43))/(-1.412+0.0525*$B$39+2.671*EXP(0.0268*$B$39)))/((14.079+2.313*EXP(0.0268*$B$39-0.341*A43))/(16.258+2.671*EXP(0.0268*$B$39))))))","v":1.9455848351673954},{"$f":"IF(OR(A43<$B$38,A43=\"\"),\"\",13.79*LN($B$37/1))","v":0.80352824302962655},{"$f":"IF(OR(A43<$B$38,A43=\"\"),\"\",SUM(E43:G43))","v":-7.0850713000290071},{"$f":"IF(Inputs!H13=\"\",1,Inputs!H13)","v":1},{"$f":"IF(OR(A43<$B$38,A43=\"\",Inputs!J13=\"No\",Method_Cetin=FALSE),NA(),MAX(1,$B$40+H43))","v":42.004928699970996},{"$f":"IF(OR(A43<$B$38,A43=\"\",Inputs!J13=\"No\",Method_Cetin=FALSE),NA(),EXP((D43-J43)/13.79))","v":0.5067739356819696},{"$f":"IF(OR(A43<$B$38,A43=\"\",Inputs!J13=\"No\",Method_Cetin=FALSE),NA(),_xlfn.NORM.S.DIST(-(B43*(1+0.004*C43)-13.79*LN(M43)-29.06*LN($B$5)-3.82*LN(H10/101.325)+0.06*C43+15.25)/4.21,TRUE))","v":0.98700458844407801},{"$f":"IF(OR(A43<$B$38,A43=\"\",Method_Cetin=FALSE),NA(),EXP((J43-29.06*LN($B$41)-3.82*LN(H10/101.325)+15.25+4.21*_xlfn.NORM.S.INV(0.5))/13.79))","v":2.6853170884224604},{"$f":"IF(OR(A43=\"\",Method_Cetin=FALSE),NA(),I43*EXP((D43-29.06*LN($B$41)-3.82*LN(H10/101.325)+15.25+4.21*_xlfn.NORM.S.INV(0.5))/13.79))","v":1.3608487094538979},null,null,null,null,null,null,null,null,{"$f":"W10","v":20},{"$f":"V10","v":8.9279867159999995},{"$f":"IF(A43=\"\",\"\",MIN(1.6,(101.325/X43)^0.5))","v":1.6},{"$f":"IF(A43=\"\",\"\",W43*Y43)","v":32},{"$f":"IF(A43=\"\",\"\",Efficiency/60)","v":1.2833333333333334},{"$f":"IF(A43=\"\",\"\",IF(Rod_L+A43<3,0.75,IF(Rod_L+A43>20,1,IF(Rod_L+A43<9,((Rod_L+A43)/9.869)^(1/4.1397),((Rod_L+A43)/18.961)^(1/17.456)))))","v":0.75},{"$f":"IF(A43=\"\",\"\",IF(Bore_D<=115,1,IF(Bore_D<200,1.05,1.15)))","v":1},{"$f":"IF(A43=\"\",\"\",IF(no_liners=\"NL\",IF(AE43<=10,1.1,IF(AE43>30,1.3,1+AE43/100)),1))","v":1},{"$f":"IF($A43=\"\",\"\",$Z43*$AA43*$AB43*$AC43*$AD43)","v":30.800000000000004},null,30.800000000000004,null,null,null,null,null,null,null,{"$f":"(AR43/9.869)^(1/4.1397)","v":0.75002377615896221},0.75,null,3]
[{"$f":"IF(A11=\"\",\"\",A11)","v":1.6763999999999999},{"$f":"IF(A44=\"\",\"\",AE44)","v":9.6360496090214056},{"$f":"IF(D11=\"\",\"\",D11)","v":10},10.621491593382261,{"$f":"IF(OR(A44<$B$38,A44=\"\"),\"\",13.79*LN((1-0.2*$B$4/A44)/(1+0.6*$B$4/A44))+3.82*LN(A44/6*(1+0.6*$B$4/A44)))","v":-4.870923378848433},{"$f":"IF(OR(A44<$B$38,A44=\"\"),\"\",13.79*(LN(((-1.412+0.0525*$B$39+2.671*EXP(0.0268*$B$39-0.341*A44))/(-1.412+0.0525*$B$39+2.671*EXP(0.0268*$B$39)))/((14.079+2.313*EXP(0.0268*$B$39-0.341*A44))/(16.258+2.671*EXP(0.0268*$B$39))))))","v":1.809594907170164},{"$f":"IF(OR(A44<$B$38,A44=\"\"),\"\",13.79*LN($B$37/1))","v":0.80352824302962655},{"$f":"IF(OR(A44<$B$38,A44=\"\"),\"\",SUM(E44:G44))","v":-2.2578002286486423},{"$f":"IF(Inputs!H14=\"\",1,Inputs!H14)","v":1},{"$f":"IF(OR(A44<$B$38,A44=\"\",Inputs!J14=\"No\",Method_Cetin=FALSE),NA(),MAX(1,$B$40+H44))","v":46.832199771351362},{"$f":"IF(OR(A44<$B$38,A44=\"\",Inputs!J14=\"No\",Method_Cetin=FALSE),NA(),EXP((D44-J44)/13.79))","v":7.2376967184628785E-2},{"$f":"IF(OR(A44<$B$38,A44=\"\",Inputs!J14=\"No\",Method_Cetin=FALSE),NA(),_xlfn.NORM.S.DIST(-(B44*(1+0.004*C44)-13.79*LN(M44)-29.06*LN($B$5)-3.82*LN(H11/101.325)+0.06*C44+15.25)/4.21,TRUE))","v":1},{"$f":"IF(OR(A44<$B$38,A44=\"\",Method_Cetin=FALSE),NA(),EXP((J44-29.06*LN($B$41)-3.82*LN(H11/101.325)+15.25+4.21*_xlfn.NORM.S.INV(0.5))/13.79))","v":2.6589660085161717},0.19244789554341832,null,null,null,null,null,null,null,null,{"$f":"W11","v":6.16},{"$f":"V11","v":31.241364491999995},{"$f":"IF(A44=\"\",\"\",MIN(1.6,(101.325/X44)^0.5))","v":1.6},{"$f":"IF(A44=\"\",\"\",W44*Y44)","v":9.8560000000000016},1.2833333333333334,0.76183138037253884,1,1,9.6360496090214056,null,9.6360496090214056,null,null,null,null,null,null,null,0.80399927434982477,0.8,null,4]
[3.2004000000000001,{"$f":"IF(A45=\"\",\"\",AE45)","v":12.235900757697163},10,13.32533678800505,-2.4008076088347328,1.5500852036431705,0.80352824302962655,-4.7194162161935727E-2,{"$f":"IF(Inputs!H15=\"\",1,Inputs!H15)","v":1},{"$f":"IF(OR(A45<$B$38,A45=\"\",Inputs!J15=\"No\",Method_Cetin=FALSE),NA(),MAX(1,$B$40+H45))","v":49.042805837838067},{"$f":"IF(OR(A45<$B$38,A45=\"\",Inputs!J15=\"No\",Method_Cetin=FALSE),NA(),EXP((D45-J45)/13.79))","v":7.5012592581681872E-2},{"$f":"IF(OR(A45<$B$38,A45=\"\",Inputs!J15=\"No\",Method_Cetin=FALSE),NA(),_xlfn.NORM.S.DIST(-(B45*(1+0.004*C45)-13.79*LN(M45)-29.06*LN($B$5)-3.82*LN(H12/101.325)+0.06*C45+15.25)/4.21,TRUE))","v":1},2.6093956450717322,0.1957375324081809,null,null,null,null,null,null,null,null,7.68,46.055452211999992,1.483261693138856,11.391449803306413,1.2833333333333334,0.83698460577980938,1,1,12.235900757697163,null,12.235900757697163,null,null,null,null,null,null,null,0.84852681007212671,0.85,null,5]
[4.5720000000000001,{"$f":"IF(A46=\"\",\"\",AE46)","v":1.6947589772898803},60,4.0320252341104634,-1.0383093229887748,1.1967512051406066,0.80352824302962655,0.96197012518145841,{"$f":"IF(Inputs!H16=\"\",1,Inputs!H16)","v":1},{"$f":"IF(OR(A46<$B$38,A46=\"\",Inputs!J16=\"No\",Method_Cetin=FALSE),NA(),MAX(1,$B$40+H46))","v":{"$error":"#N/A"}},{"$f":"IF(OR(A46<$B$38,A46=\"\",Inputs!J16=\"No\",Method_Cetin=FALSE),NA(),EXP((D46-J46)/13.79))","v":{"$error":"#N/A"}},{"$f":"IF(OR(A46<$B$38,A46=\"\",Inputs!J16=\"No\",Method_Cetin=FALSE),NA(),_xlfn.NORM.S.DIST(-(B46*(1+0.004*C46)-13.79*LN(M46)-29.06*LN($B$5)-3.82*LN(H13/101.325)+0.06*C46+15.25)/4.21,TRUE))","v":{"$error":"#N/A"}},{"$error":"#N/A"},9.0382852623987819E-2,null,null,null,null,null,null,null,null,1.1357999999999999,59.388131159999993,1.3061963826534233,1.483577851417758,1.2833333333333334,0.89013961054570123,1,1,1.6947589772898803,null,1.6947589772898803,null,null,null,null,null,null,null,0.8867329766802311,0.9,null,6]
[6.2484000000000002,20.814634562240858,10,22.247219944730496,0.15496197387224789,0.55798573332353796,0.80352824302962655,1.5164759502254124,{"$f":"IF(Inputs!H17=\"\",1,Inputs!H17)","v":1},{"$f":"IF(OR(A47<$B$38,A47=\"\",Inputs!J17=\"No\",Method_Cetin=FALSE),NA(),MAX(1,$B$40+H47))","v":50.606475950225416},{"$f":"IF(OR(A47<$B$38,A47=\"\",Inputs!J17=\"No\",Method_Cetin=FALSE),NA(),EXP((D47-J47)/13.79))","v":0.12789971804790864},{"$f":"IF(OR(A47<$B$38,A47=\"\",Inputs!J17=\"No\",Method_Cetin=FALSE),NA(),_xlfn.NORM.S.DIST(-(B47*(1+0.004*C47)-13.79*LN(M47)-29.06*LN($B$5)-3.82*LN(H14/101.325)+0.06*C47+15.25)/4.21,TRUE))","v":0.99999999999186895},2.4282607055619039,0.31057385958818323,null,null,null,null,null,null,null,null,14.850000000000001,75.683627651999984,1.1570638788109513,17.18239860034263,1.2833333333333334,0.94394246926978276,1,1,20.814634562240858,null,20.814634562240858,null,null,null,null,null,null,null,0.92037487337803148,0.92,null,7]
[7.7724000000000002,28.679310145415499,10,30.426482551232123,0.98869059606871645,-0.25288289964721866,0.80352824302962655,1.5393359394511243,{"$f":"IF(Inputs!H18=\"\",1,Inputs!H18)","v":1},{"$f":"IF(OR(A48<$B$38,A48=\"\",Inputs!J18=\"No\",Method_Cetin=FALSE),NA(),MAX(1,$B$40+H48))","v":50.629335939451124},{"$f":"IF(OR(A48<$B$38,A48=\"\",Inputs!J18=\"No\",Method_Cetin=FALSE),NA(),EXP((D48-J48)/13.79))","v":0.23106955639281196},{"$f":"IF(OR(A48<$B$38,A48=\"\",Inputs!J18=\"No\",Method_Cetin=FALSE),NA(),_xlfn.NORM.S.DIST(-(B48*(1+0.004*C48)-13.79*LN(M48)-29.06*LN($B$5)-3.82*LN(H15/101.325)+0.06*C48+15.25)/4.21,TRUE))","v":0.99999920181503199},2.2895929161369906,0.52905521945189915,null,null,null,null,null,null,null,null,22,90.497715371999988,1.0581311471024051,23.278885236252911,1.2833333333333334,0.95999074578634036,1,1,28.679310145415499,null,28.679310145415499,null,null,null,null,null,null,null,0.95054675925615573,0.94,null,8]
[9.2964000000000002,19.503974728605119,10,20.884133717749325,1.6726548402038408,-1.2652551758018726,0.80352824302962655,1.2109279074315946,{"$f":"IF(Inputs!H19=\"\",1,Inputs!H19)","v":1},{"$f":"IF(OR(A49<$B$38,A49=\"\",Inputs!J19=\"No\",Method_Cetin=FALSE),NA(),MAX(1,$B$40+H49))","v":50.3009279074316},{"$f":"IF(OR(A49<$B$38,A49=\"\",Inputs!J19=\"No\",Method_Cetin=FALSE),NA(),EXP((D49-J49)/13.79))","v":0.11845791274525296},{"$f":"IF(OR(A49<$B$38,A49=\"\",Inputs!J19=\"No\",Method_Cetin=FALSE),NA(),_xlfn.NORM.S.DIST(-(B49*(1+0.004*C49)-13.79*LN(M49)-29.06*LN($B$5)-3.82*LN(H16/101.325)+0.06*C49+15.25)/4.21,TRUE))","v":0.99999999999859945},2.1275275435569823,0.25202247211779544,null,null,null,null,null,null,null,null,16,105.31180309200001,0.98088881404563821,15.694221024730211,1.2833333333333334,0.96837570733698275,1,1,19.503974728605119,null,19.503974728605119,null,null,null,null,null,null,null,{"$f":"(AR49/18.961)^(1/17.456)","v":0.95821041852825428},0.95699999999999996,0.95699999999999996,9]
[10.820399999999999,8.222572974280391,10,9.1514758932516074,2.2525538093596165,-2.3909707300490251,0.80352824302962655,0.66511132234021797,{"$f":"IF(Inputs!H20=\"\",1,Inputs!H20)","v":1},{"$f":"IF(OR(A50<$B$38,A50=\"\",Inputs!J20=\"No\",Method_Cetin=FALSE),NA(),MAX(1,$B$40+H50))","v":49.75511132234022},{"$f":"IF(OR(A50<$B$38,A50=\"\",Inputs!J20=\"No\",Method_Cetin=FALSE),NA(),EXP((D50-J50)/13.79))","v":5.2632258672442339E-2},{"$f":"IF(OR(A50<$B$38,A50=\"\",Inputs!J20=\"No\",Method_Cetin=FALSE),NA(),_xlfn.NORM.S.DIST(-(B50*(1+0.004*C50)-13.79*LN(M50)-29.06*LN($B$5)-3.82*LN(H17/101.325)+0.06*C50+15.25)/4.21,TRUE))","v":1},1.9607514306875602,0.10319877649230906,null,null,null,null,null,null,null,null,7.15,120.12589081199998,0.91841717257661126,6.5666827839227713,1.2833333333333334,0.97571329863919298,1,1,8.222572974280391,null,8.222572974280391,null,null,null,null,null,null,null,{"$f":"(AR50/18.961)^(1/17.456)","v":0.96401145177240277},null,0.96399999999999997,10]
[12.4968,1.7936216801192344,70,4.144728715335928,2.8027842036112389,-3.5965627894518786,0.80352824302962655,9.7496571889869044E-3,{"$f":"IF(Inputs!H21=\"\",1,Inputs!H21)","v":1},{"$f":"IF(OR(A51<$B$38,A51=\"\",Inputs!J21=\"No\",Method_Cetin=FALSE),NA(),MAX(1,$B$40+H51))","v":{"$error":"#N/A"}},{"$f":"IF(OR(A51<$B$38,A51=\"\",Inputs!J21=\"No\",Method_Cetin=FALSE),NA(),EXP((D51-J51)/13.79))","v":{"$error":"#N/A"}},{"$f":"IF(OR(A51<$B$38,A51=\"\",Inputs!J21=\"No\",Method_Cetin=FALSE),NA(),_xlfn.NORM.S.DIST(-(B51*(1+0.004*C51)-13.79*LN(M51)-29.06*LN($B$5)-3.82*LN(H18/101.325)+0.06*C51+15.25)/4.21,TRUE))","v":{"$error":"#N/A"}},{"$error":"#N/A"},6.8970953672722005E-2,null,null,null,null,null,null,null,null,1.6500000000000001,136.42138730399998,0.86182100601954414,1.422004659932248,1.2833333333333334,0.98285703457285678,1,1,1.7936216801192344,null,1.7936216801192344,null,null,null,null,null,null,null,0.96928937315966979,null,0.97,11]
[13.715999999999999,1.7286856333565144,5,2.0632593460236448,3.1583896197234043,-4.3589457098823683,0.80352824302962655,-0.39702784712933747,{"$f":"IF(Inputs!H22=\"\",1,Inputs!H22)","v":1},{"$f":"IF(OR(A52<$B$38,A52=\"\",Inputs!J22=\"No\",Method_Cetin=FALSE),NA(),MAX(1,$B$40+H52))","v":48.692972152870666},{"$f":"IF(OR(A52<$B$38,A52=\"\",Inputs!J22=\"No\",Method_Cetin=FALSE),NA(),EXP((D52-J52)/13.79))","v":3.399931176180504E-2},{"$f":"IF(OR(A52<$B$38,A52=\"\",Inputs!J22=\"No\",Method_Cetin=FALSE),NA(),_xlfn.NORM.S.DIST(-(B52*(1+0.004*C52)-13.79*LN(M52)-29.06*LN($B$5)-3.82*LN(H19/101.325)+0.06*C52+15.25)/4.21,TRUE))","v":1},1.6999817010556288,5.7798207843553974E-2,null,null,null,null,null,null,null,null,1.6500000000000001,148.27265747999994,0.82666161177225983,1.3639916594242287,1.2833333333333334,0.98756305212338302,1,1,1.7286856333565144,null,1.7286856333565144,null,null,null,null,null,null,null,0.97413296572536268,null,0.97499999999999998,12]
[15.6972,9.826321161529588,5,10.322847584760181,3.6737814140990004,-5.3029027710558241,0.80352824302962655,-0.82559311392719714,{"$f":"IF(Inputs!H23=\"\",1,Inputs!H23)","v":1},{"$f":"IF(OR(A53<$B$38,A53=\"\",Inputs!J23=\"No\",Method_Cetin=FALSE),NA(),MAX(1,$B$40+H53))","v":48.264406886072805},{"$f":"IF(OR(A53<$B$38,A53=\"\",Inputs!J23=\"No\",Method_Cetin=FALSE),NA(),EXP((D53-J53)/13.79))","v":6.3839566880304122E-2},{"$f":"IF(OR(A53<$B$38,A53=\"\",Inputs!J23=\"No\",Method_Cetin=FALSE),NA(),_xlfn.NORM.S.DIST(-(B53*(1+0.004*C53)-13.79*LN(M53)-29.06*LN($B$5)-3.82*LN(H20/101.325)+0.06*C53+15.25)/4.21,TRUE))","v":1},1.5875075349827623,0.10134579345251878,null,null,null,null,null,null,null,null,9.9,167.53097151599999,0.7776975892625777,7.6992061336995192,1.2833333333333334,0.99450170568189988,1,1,9.826321161529588,null,9.826321161529588,null,null,null,null,null,null,null,0.97861000975841117,null,0.98,13]
[17.3736,2.6196491173635703,5,2.9720420997108414,4.0613947519287645,-5.8261754125921614,0.80352824302962655,-0.96125241763377034,{"$f":"IF(Inputs!H24=\"\",1,Inputs!H24)","v":1},{"$f":"IF(OR(A54<$B$38,A54=\"\",Inputs!J24=\"No\",Method_Cetin=FALSE),NA(),MAX(1,$B$40+H54))","v":48.128747582366231},{"$f":"IF(OR(A54<$B$38,A54=\"\",Inputs!J24=\"No\",Method_Cetin=FALSE),NA(),EXP((D54-J54)/13.79))","v":3.783207723839474E-2},{"$f":"IF(OR(A54<$B$38,A54=\"\",Inputs!J24=\"No\",Method_Cetin=FALSE),NA(),_xlfn.NORM.S.DIST(-(B54*(1+0.004*C54)-13.79*LN(M54)-29.06*LN($B$5)-3.82*LN(H21/101.325)+0.06*C54+15.25)/4.21,TRUE))","v":1},1.5283968779578039,5.7822428737821022E-2,null,null,null,null,null,null,null,null,2.75,183.82646800800001,0.74242790124690194,2.0416767284289805,1.2833333333333334,0.99980814694782039,1,1,2.6196491173635703,null,2.6196491173635703,null,null,null,null,null,null,null,0.98277344732440974,null,0.98399999999999999,14]
["","","",{"$error":"#N/A"},"","","","",{"$f":"IF(Inputs!H25=\"\",1,Inputs!H25)","v":1},{"$f":"IF(OR(A55<$B$38,A55=\"\",Inputs!J25=\"No\",Method_Cetin=FALSE),NA(),MAX(1,$B$40+H55))","v":{"$error":"#N/A"}},{"$f":"IF(OR(A55<$B$38,A55=\"\",Inputs!J25=\"No\",Method_Cetin=FALSE),NA(),EXP((D55-J55)/13.79))","v":{"$error":"#N/A"}},{"$f":"IF(OR(A55<$B$38,A55=\"\",Inputs!J25=\"No\",Method_Cetin=FALSE),NA(),_xlfn.NORM.S.DIST(-(B55*(1+0.004*C55)-13.79*LN(M55)-29.06*LN($B$5)-3.82*LN(H22/101.325)+0.06*C55+15.25)/4.21,TRUE))","v":{"$error":"#N/A"}},{"$error":"#N/A"},{"$error":"#N/A"},null,null,null,null,null,null,null,null,"","","","","","","","","",null,"",null,null,null,null,null,null,null,0.98666543480189284,null,0.98599999999999999,15]
["","","",{"$error":"#N/A"},"","","","",{"$f":"IF(Inputs!H26=\"\",1,Inputs!H26)","v":1},{"$f":"IF(OR(A56<$B$38,A56=\"\",Inputs!J26=\"No\",Method_Cetin=FALSE),NA(),MAX(1,$B$40+H56))","v":{"$error":"#N/A"}},{"$f":"IF(OR(A56<$B$38,A56=\"\",Inputs!J26=\"No\",Method_Cetin=FALSE),NA(),EXP((D56-J56)/13.79))","v":{"$error":"#N/A"}},{"$f":"IF(OR(A56<$B$38,A56=\"\",Inputs!J26=\"No\",Method_Cetin=FALSE),NA(),_xlfn.NORM.S.DIST(-(B56*(1+0.004*C56)-13.79*LN(M56)-29.06*LN($B$5)-3.82*LN(H23/101.325)+0.06*C56+15.25)/4.21,TRUE))","v":{"$error":"#N/A"}},{"$error":"#N/A"},{"$error":"#N/A"},null,null,null,null,null,null,null,null,"","","","","","","","","",null,"",null,null,null,null,null,null,null,0.99032009730220838,null,0.98799999999999999,16]
["","","",{"$error":"#N/A"},"","","","",{"$f":"IF(Inputs!H27=\"\",1,Inputs!H27)","v":1},{"$f":"IF(OR(A57<$B$38,A57=\"\",Inputs!J27=\"No\",Method_Cetin=FALSE),NA(),MAX(1,$B$40+H57))","v":{"$error":"#N/A"}},{"$f":"IF(OR(A57<$B$38,A57=\"\",Inputs!J27=\"No\",Method_Cetin=FALSE),NA(),EXP((D57-J57)/13.79))","v":{"$error":"#N/A"}},{"$f":"IF(OR(A57<$B$38,A57=\"\",Inputs!J27=\"No\",Method_Cetin=FALSE),NA(),_xlfn.NORM.S.DIST(-(B57*(1+0.004*C57)-13.79*LN(M57)-29.06*LN($B$5)-3.82*LN(H24/101.325)+0.06*C57+15.25)/4.21,TRUE))","v":{"$error":"#N/A"}},{"$error":"#N/A"},{"$error":"#N/A"},null,null,null,null,null,null,null,null,"","","","","","","","","",null,"",null,null,null,null,null,null,null,1,null,1,20]
["","","",{"$error":"#N/A"},"","","","",{"$f":"IF(Inputs!H28=\"\",1,Inputs!H28)","v":1},{"$f":"IF(OR(A58<$B$38,A58=\"\",Inputs!J28=\"No\",Method_Cetin=FALSE),NA(),MAX(1,$B$40+H58))","v":{"$error":"#N/A"}},{"$f":"IF(OR(A58<$B$38,A58=\"\",Inputs!J28=\"No\",Method_Cetin=FALSE),NA(),EXP((D58-J58)/13.79))","v":{"$error":"#N/A"}},{"$f":"IF(OR(A58<$B$38,A58=\"\",Inputs!J28=\"No\",Method_Cetin=FALSE),NA(),_xlfn.NORM.S.DIST(-(B58*(1+0.004*C58)-13.79*LN(M58)-29.06*LN($B$5)-3.82*LN(H25/101.325)+0.06*C58+15.25)/4.21,TRUE))","v":{"$error":"#N/A"}},{"$error":"#N/A"},{"$error":"#N/A"},null,null,null,null,null,null,null,null,"","","","","","","","","",null,"",null,null,null,null,null,null,null,1,null,1,25]
["","","",{"$error":"#N/A"},"","","","",{"$f":"IF(Inputs!H29=\"\",1,Inputs!H29)","v":1},{"$f":"IF(OR(A59<$B$38,A59=\"\",Inputs!J29=\"No\",Method_Cetin=FALSE),NA(),MAX(1,$B$40+H59))","v":{"$error":"#N/A"}},{"$f":"IF(OR(A59<$B$38,A59=\"\",Inputs!J29=\"No\",Method_Cetin=FALSE),NA(),EXP((D59-J59)/13.79))","v":{"$error":"#N/A"}},{"$f":"IF(OR(A59<$B$38,A59=\"\",Inputs!J29=\"No\",Method_Cetin=FALSE),NA(),_xlfn.NORM.S.DIST(-(B59*(1+0.004*C59)-13.79*LN(M59)-29.06*LN($B$5)-3.82*LN(H26/101.325)+0.06*C59+15.25)/4.21,TRUE))","v":{"$error":"#N/A"}},{"$error":"#N/A"},{"$error":"#N/A"},null,null,null,null,null,null,null,null,"","","","","","","","","",null,"",null,null,null,null,null,null,null,1,null,1,30]
["","","",{"$error":"#N/A"},"","","","",{"$f":"IF(Inputs!H30=\"\",1,Inputs!H30)","v":1},{"$f":"IF(OR(A60<$B$38,A60=\"\",Inputs!J30=\"No\",Method_Cetin=FALSE),NA(),MAX(1,$B$40+H60))","v":{"$error":"#N/A"}},{"$f":"IF(OR(A60<$B$38,A60=\"\",Inputs!J30=\"No\",Method_Cetin=FALSE),NA(),EXP((D60-J60)/13.79))","v":{"$error":"#N/A"}},{"$f":"IF(OR(A60<$B$38,A60=\"\",Inputs!J30=\"No\",Method_Cetin=FALSE),NA(),_xlfn.NORM.S.DIST(-(B60*(1+0.004*C60)-13.79*LN(M60)-29.06*LN($B$5)-3.82*LN(H27/101.325)+0.06*C60+15.25)/4.21,TRUE))","v":{"$error":"#N/A"}},{"$error":"#N/A"},{"$error":"#N/A"},null,null,null,null,null,null,null,null,"","","","","","","","","",null,""]
["","","",{"$error":"#N/A"},"","","","",{"$f":"IF(Inputs!H31=\"\",1,Inputs!H31)","v":1},{"$f":"IF(OR(A61<$B$38,A61=\"\",Inputs!J31=\"No\",Method_Cetin=FALSE),NA(),MAX(1,$B$40+H61))","v":{"$error":"#N/A"}},{"$f":"IF(OR(A61<$B$38,A61=\"\",Inputs!J31=\"No\",Method_Cetin=FALSE),NA(),EXP((D61-J61)/13.79))","v":{"$error":"#N/A"}},{"$f":"IF(OR(A61<$B$38,A61=\"\",Inputs!J31=\"No\",Method_Cetin=FALSE),NA(),_xlfn.NORM.S.DIST(-(B61*(1+0.004*C61)-13.79*LN(M61)-29.06*LN($B$5)-3.82*LN(H28/101.325)+0.06*C61+15.25)/4.21,TRUE))","v":{"$error":"#N/A"}},{"$error":"#N/A"},{"$error":"#N/A"},null,null,null,null,null,null,null,null,"","","","","","","","","",null,""]
["","","",{"$error":"#N/A"},"","","","",{"$f":"IF(Inputs!H32=\"\",1,Inputs!H32)","v":1},{"$f":"IF(OR(A62<$B$38,A62=\"\",Inputs!J32=\"No\",Method_Cetin=FALSE),NA(),MAX(1,$B$40+H62))","v":{"$error":"#N/A"}},{"$f":"IF(OR(A62<$B$38,A62=\"\",Inputs!J32=\"No\",Method_Cetin=FALSE),NA(),EXP((D62-J62)/13.79))","v":{"$error":"#N/A"}},{"$f":"IF(OR(A62<$B$38,A62=\"\",Inputs!J32=\"No\",Method_Cetin=FALSE),NA(),_xlfn.NORM.S.DIST(-(B62*(1+0.004*C62)-13.79*LN(M62)-29.06*LN($B$5)-3.82*LN(H29/101.325)+0.06*C62+15.25)/4.21,TRUE))","v":{"$error":"#N/A"}},{"$error":"#N/A"},{"$error":"#N/A"},null,null,null,null,null,null,null,null,"","","","","","","","","",null,""]

{"sheet":"Det Liquefaction Initiation","index":5,"n_rows":62,"n_cols":21,"rows_kept":62,"cut":false,"hidden":false,"merged":[]}
["Deterministic Liquefaction Triggering using Boulanger & Idriss (2008, 2014)"]
["PGA:",{"$f":"IF(PGA_det=\"\",NA(),PGA_det)","v":0.73},"g","amax =",{"$f":"B2*B3","v":0.73}]
["Fpga:",{"$f":"IF(Fpga_det=\"\",NA(),Fpga_det)","v":1}]
["Depth to Water:",{"$f":"'PB Liquefaction Initiation'!B4","v":0},"m"]
["Mw:",{"$f":"IF(Mw_det=\"\",NA(),Mw_det)","v":6.8}]
[]
["σε :",0.27700000000000002]
[null,null,null,null,null,null,null,null,null,null,null,null,null,null,null,null,null,null,null,null,"For 2014 MSF Factor"]
["Depth (m):","(N1)60","g (kN/m3)","Fines (%)","Thickness (m)","(N1)60,cs","sv (kPa)","sv' (kPa)","α","β","rd","MSF","Csig","Ksig","KDR(aging)","Nreqsite","FSL","PL","CSR(site)","CRR","MSFmax"]
[{"$f":"IF('PB Liquefaction Initiation'!A10=\"\",\"\",'PB Liquefaction Initiation'!A10)","v":0.4572},{"$f":"'PB Liquefaction Initiation'!B10","v":32.725000000000009},{"$f":"IF('PB Liquefaction Initiation'!C10=\"\",\"\",'PB Liquefaction Initiation'!C10)","v":19.527529999999999},{"$f":"IF('PB Liquefaction Initiation'!D10=\"\",\"\",'PB Liquefaction Initiation'!D10)","v":10},{"$f":"IF('PB Liquefaction Initiation'!E10=\"\",\"\",'PB Liquefaction Initiation'!E10)","v":0.91439999999999999},{"$f":"IF(OR('PB Liquefaction Initiation'!F10=\"\",Method_BI=FALSE),NA(),'PB Liquefaction Initiation'!F10)","v":33.874185446686866},{"$f":"IF('PB Liquefaction Initiation'!G10=\"\",\"\",'PB Liquefaction Initiation'!G10)","v":8.9279867159999995},{"$f":"IF('PB Liquefaction Initiation'!H10=\"\",\"\",'PB Liquefaction Initiation'!H10)","v":4.4442263159999991},{"$f":"IF(OR(A10<$B$4,A10=\"\"),\"\",-1.012-1.126*SIN(A10/11.73+5.133))","v":-2.8390214252640433E-3},{"$f":"IF(OR(A10<$B$4,A10=\"\"),\"\",0.106+0.118*SIN(A10/11.28+5.142))","v":8.0258157090774829E-4},{"$f":"IF(OR(A10<$B$4,A10=\"\"),\"\",EXP(I10+J10*$B$5))","v":1.0026219646095007},{"$f":"IF(OR(A10<$B$4,A10=\"\"),\"\",IF(IB_MSF=2014,1+(U10-1)*(8.64*EXP(-Mw_det/4)-1.325),MIN(1.8,6.9*EXP(-$B$5/4)-0.058)))","v":1.304062777378753},{"$f":"IF(OR(A10<$B$4,A10=\"\"),\"\",MIN(0.3,1/(18.9-2.55*SQRT(F10))))","v":0.24638984283442145},{"$f":"IF(OR(A10<$B$4,A10=\"\"),\"\",1-M10*LN(H10/101.325))","v":1.7703938667195627},{"$f":"IF(Inputs!H13=\"\",1,Inputs!H13)","v":1},30.872833251953125,{"$f":"IF(OR(A10=\"\",A10<$B$4,Method_BI=FALSE),NA(),T10/S10)","v":1.8540697745700523},{"$f":"IF(OR(A10<$B$4,A10=\"\",Method_BI=FALSE),NA(),_xlfn.NORM.S.DIST(-(LN(T10)-LN(S10))/0.277,TRUE))","v":1.2912946515657218E-2},{"$f":"IF(OR(A10<$B$4,A10=\"\",Inputs!J13=\"No\",Method_BI=FALSE),NA(),0.65*($B$2*$B$3)*G10/H10*K10/L10/N10)","v":0.41396383811397325},{"$f":"IF(OR(A10=\"\",Method_BI=FALSE),NA(),O10*EXP(F10/14.1+(F10/126)^2-(F10/23.6)^3+(F10/25.4)^4-2.67+0.277*_xlfn.NORM.S.INV(1-Percentile_Liq/100)))","v":0.76751784001212797},{"$f":"MIN(2.2,1.09+((F10/31.5)^2))","v":2.2000000000000002}]
[{"$f":"IF('PB Liquefaction Initiation'!A11=\"\",\"\",'PB Liquefaction Initiation'!A11)","v":1.6763999999999999},{"$f":"'PB Liquefaction Initiation'!B11","v":10.751253333333334},{"$f":"IF('PB Liquefaction Initiation'!C11=\"\",\"\",'PB Liquefaction Initiation'!C11)","v":19.527529999999999},{"$f":"IF('PB Liquefaction Initiation'!D11=\"\",\"\",'PB Liquefaction Initiation'!D11)","v":10},{"$f":"IF('PB Liquefaction Initiation'!E11=\"\",\"\",'PB Liquefaction Initiation'!E11)","v":1.524},{"$f":"IF(OR('PB Liquefaction Initiation'!F11=\"\",Method_BI=FALSE),NA(),'PB Liquefaction Initiation'!F11)","v":11.900438780020192},{"$f":"IF('PB Liquefaction Initiation'!G11=\"\",\"\",'PB Liquefaction Initiation'!G11)","v":32.735951291999996},{"$f":"IF('PB Liquefaction Initiation'!H11=\"\",\"\",'PB Liquefaction Initiation'!H11)","v":16.295496491999995},{"$f":"IF(OR(A11<$B$4,A11=\"\"),\"\",-1.012-1.126*SIN(A11/11.73+5.133))","v":-6.010600017897838E-2},{"$f":"IF(OR(A11<$B$4,A11=\"\"),\"\",0.106+0.118*SIN(A11/11.28+5.142))","v":7.1829753563227156E-3},{"$f":"IF(OR(A11<$B$4,A11=\"\"),\"\",EXP(I11+J11*$B$5))","v":0.9888014085690755},1.0589695737438447,{"$f":"IF(OR(A11<$B$4,A11=\"\"),\"\",MIN(0.3,1/(18.9-2.55*SQRT(F11))))","v":9.8977936132341141E-2},{"$f":"IF(OR(A11<$B$4,A11=\"\"),\"\",1-M11*LN(H11/101.325))","v":1.1808766742881569},{"$f":"IF(Inputs!H14=\"\",1,Inputs!H14)","v":1},34.456560134887695,0.15109424382340919,0.99999999999552869,{"$f":"IF(OR(A11<$B$4,A11=\"\",Inputs!J14=\"No\",Method_BI=FALSE),NA(),0.65*($B$2*$B$3)*G11/H11*K11/L11/N11)","v":0.75372797671486647},0.11388395869028091,{"$f":"MIN(2.2,1.09+((F11/31.5)^2))","v":1.2327265741063327}]
[{"$f":"IF('PB Liquefaction Initiation'!A12=\"\",\"\",'PB Liquefaction Initiation'!A12)","v":3.2004000000000001},{"$f":"'PB Liquefaction Initiation'!B12","v":12.544218221569151},{"$f":"IF('PB Liquefaction Initiation'!C12=\"\",\"\",'PB Liquefaction Initiation'!C12)","v":19.527529999999999},{"$f":"IF('PB Liquefaction Initiation'!D12=\"\",\"\",'PB Liquefaction Initiation'!D12)","v":10},{"$f":"IF('PB Liquefaction Initiation'!E12=\"\",\"\",'PB Liquefaction Initiation'!E12)","v":1.524},{"$f":"IF(OR('PB Liquefaction Initiation'!F12=\"\",Method_BI=FALSE),NA(),'PB Liquefaction Initiation'!F12)","v":13.693403668256009},{"$f":"IF('PB Liquefaction Initiation'!G12=\"\",\"\",'PB Liquefaction Initiation'!G12)","v":62.495907011999996},{"$f":"IF('PB Liquefaction Initiation'!H12=\"\",\"\",'PB Liquefaction Initiation'!H12)","v":31.109584211999994},{"$f":"IF(OR(A12<$B$4,A12=\"\"),\"\",-1.012-1.126*SIN(A12/11.73+5.133))","v":-0.14605483031814692},{"$f":"IF(OR(A12<$B$4,A12=\"\"),\"\",0.106+0.118*SIN(A12/11.28+5.142))","v":1.6770267461211796E-2},{"$f":"IF(OR(A12<$B$4,A12=\"\"),\"\",EXP(I12+J12*$B$5))","v":0.96849010639028854},1.0706879700529888,{"$f":"IF(OR(A12<$B$4,A12=\"\"),\"\",MIN(0.3,1/(18.9-2.55*SQRT(F12))))","v":0.10566549665567099},{"$f":"IF(OR(A12<$B$4,A12=\"\"),\"\",1-M12*LN(H12/101.325))","v":1.1247716387278885},{"$f":"IF(Inputs!H15=\"\",1,Inputs!H15)","v":1},34.541889190673828,0.16405473453769903,0.99999999996610567,{"$f":"IF(OR(A12<$B$4,A12=\"\",Inputs!J15=\"No\",Method_BI=FALSE),NA(),0.65*($B$2*$B$3)*G12/H12*K12/L12/N12)","v":0.76658707737983955},0.12576223947958012,1.278973851369924]
[{"$f":"IF('PB Liquefaction Initiation'!A13=\"\",\"\",'PB Liquefaction Initiation'!A13)","v":4.5720000000000001},{"$f":"'PB Liquefaction Initiation'!B13","v":1.9867806522050186},{"$f":"IF('PB Liquefaction Initiation'!C13=\"\",\"\",'PB Liquefaction Initiation'!C13)","v":19.527529999999999},{"$f":"IF('PB Liquefaction Initiation'!D13=\"\",\"\",'PB Liquefaction Initiation'!D13)","v":60},{"$f":"IF('PB Liquefaction Initiation'!E13=\"\",\"\",'PB Liquefaction Initiation'!E13)","v":1.2192000000000001},{"$f":"IF(OR('PB Liquefaction Initiation'!F13=\"\",Method_BI=FALSE),NA(),'PB Liquefaction Initiation'!F13)","v":7.5891695726420965},{"$f":"IF('PB Liquefaction Initiation'!G13=\"\",\"\",'PB Liquefaction Initiation'!G13)","v":89.279867159999995},{"$f":"IF('PB Liquefaction Initiation'!H13=\"\",\"\",'PB Liquefaction Initiation'!H13)","v":44.442263159999996},-0.23593541432620369,2.6794925273762593E-2,0.9476880211869122,1.0375125659620072,8.4209491701384948E-2,1.0694006027281664,{"$f":"IF(Inputs!H16=\"\",1,Inputs!H16)","v":1},{"$error":"#N/A"},{"$error":"#N/A"},{"$error":"#N/A"},{"$f":"IF(OR(A13<$B$4,A13=\"\",Inputs!J16=\"No\",Method_BI=FALSE),NA(),0.65*($B$2*$B$3)*G13/H13*K13/L13/N13)","v":{"$error":"#N/A"}},8.8135265298010565E-2,1.148045346235643]
[{"$f":"IF('PB Liquefaction Initiation'!A14=\"\",\"\",'PB Liquefaction Initiation'!A14)","v":6.2484000000000002},{"$f":"'PB Liquefaction Initiation'!B14","v":20.559288464609821},{"$f":"IF('PB Liquefaction Initiation'!C14=\"\",\"\",'PB Liquefaction Initiation'!C14)","v":19.527529999999999},{"$f":"IF('PB Liquefaction Initiation'!D14=\"\",\"\",'PB Liquefaction Initiation'!D14)","v":10},{"$f":"IF('PB Liquefaction Initiation'!E14=\"\",\"\",'PB Liquefaction Initiation'!E14)","v":2.1335999999999999},{"$f":"IF(OR('PB Liquefaction Initiation'!F14=\"\",Method_BI=FALSE),NA(),'PB Liquefaction Initiation'!F14)","v":21.708473911296679},{"$f":"IF('PB Liquefaction Initiation'!G14=\"\",\"\",'PB Liquefaction Initiation'!G14)","v":122.01581845199999},{"$f":"IF('PB Liquefaction Initiation'!H14=\"\",\"\",'PB Liquefaction Initiation'!H14)","v":60.737759651999987},-0.36004762462770235,4.061937222475992E-2,0.91958215312241742,1.1431473366374525,0.14247145442317927,1.0729122739859158,{"$f":"IF(Inputs!H17=\"\",1,Inputs!H17)","v":1},34.183750152587891,0.27664601158220065,0.99999824991824682,{"$f":"IF(OR(A14<$B$4,A14=\"\",Inputs!J17=\"No\",Method_BI=FALSE),NA(),0.65*($B$2*$B$3)*G14/H14*K14/L14/N14)","v":0.71468998628801128},0.19771613422431597,1.5649386138145109]
[{"$f":"IF('PB Liquefaction Initiation'!A15=\"\",\"\",'PB Liquefaction Initiation'!A15)","v":7.7724000000000002},{"$f":"'PB Liquefaction Initiation'!B15","v":27.991214213602863},{"$f":"IF('PB Liquefaction Initiation'!C15=\"\",\"\",'PB Liquefaction Initiation'!C15)","v":19.527529999999999},{"$f":"IF('PB Liquefaction Initiation'!D15=\"\",\"\",'PB Liquefaction Initiation'!D15)","v":10},{"$f":"IF('PB Liquefaction Initiation'!E15=\"\",\"\",'PB Liquefaction Initiation'!E15)","v":0.91439999999999999},{"$f":"IF(OR('PB Liquefaction Initiation'!F15=\"\",Method_BI=FALSE),NA(),'PB Liquefaction Initiation'!F15)","v":29.14039966028972},{"$f":"IF('PB Liquefaction Initiation'!G15=\"\",\"\",'PB Liquefaction Initiation'!G15)","v":151.77577417199998},{"$f":"IF('PB Liquefaction Initiation'!H15=\"\",\"\",'PB Liquefaction Initiation'!H15)","v":75.551847371999983},-0.48448445655966998,5.4446511456743056E-2,0.89203654398005017,1.2396509563074263,0.19475605168489971,1.0571636339445332,{"$f":"IF(Inputs!H18=\"\",1,Inputs!H18)","v":1},33.668972015380859,0.58107357361902523,0.97499322080302198,{"$f":"IF(OR(A15<$B$4,A15=\"\",Inputs!J18=\"No\",Method_BI=FALSE),NA(),0.65*($B$2*$B$3)*G15/H15*K15/L15/N15)","v":0.64883549021389109},0.37702115698943778,1.9457953059827799]
[{"$f":"IF('PB Liquefaction Initiation'!A16=\"\",\"\",'PB Liquefaction Initiation'!A16)","v":9.2964000000000002},{"$f":"'PB Liquefaction Initiation'!B16","v":20.1884451292024},{"$f":"IF('PB Liquefaction Initiation'!C16=\"\",\"\",'PB Liquefaction Initiation'!C16)","v":19.527529999999999},{"$f":"IF('PB Liquefaction Initiation'!D16=\"\",\"\",'PB Liquefaction Initiation'!D16)","v":10},{"$f":"IF('PB Liquefaction Initiation'!E16=\"\",\"\",'PB Liquefaction Initiation'!E16)","v":2.1335999999999999},{"$f":"IF(OR('PB Liquefaction Initiation'!F16=\"\",Method_BI=FALSE),NA(),'PB Liquefaction Initiation'!F16)","v":21.337630575889257},{"$f":"IF('PB Liquefaction Initiation'!G16=\"\",\"\",'PB Liquefaction Initiation'!G16)","v":181.53572989199998},{"$f":"IF('PB Liquefaction Initiation'!H16=\"\",\"\",'PB Liquefaction Initiation'!H16)","v":90.365935091999972},-0.61781326230388878,6.9213263799757785E-2,0.86315321286955704,1.139070857363822,0.14043231150803093,1.016074696929782,{"$f":"IF(Inputs!H19=\"\",1,Inputs!H19)","v":1},34.15599250793457,0.27162753281988083,0.99999873153506269,{"$f":"IF(OR(A16<$B$4,A16=\"\",Inputs!J19=\"No\",Method_BI=FALSE),NA(),0.65*($B$2*$B$3)*G16/H16*K16/L16/N16)","v":0.71089441090745842},0.19309849493023551,1.5488505705146125]
[{"$f":"IF('PB Liquefaction Initiation'!A17=\"\",\"\",'PB Liquefaction Initiation'!A17)","v":10.820399999999999},{"$f":"'PB Liquefaction Initiation'!B17","v":8.3384535645198135},{"$f":"IF('PB Liquefaction Initiation'!C17=\"\",\"\",'PB Liquefaction Initiation'!C17)","v":19.527529999999999},{"$f":"IF('PB Liquefaction Initiation'!D17=\"\",\"\",'PB Liquefaction Initiation'!D17)","v":10},{"$f":"IF('PB Liquefaction Initiation'!E17=\"\",\"\",'PB Liquefaction Initiation'!E17)","v":0.91439999999999999},{"$f":"IF(OR('PB Liquefaction Initiation'!F17=\"\",Method_BI=FALSE),NA(),'PB Liquefaction Initiation'!F17)","v":9.4876390112066709},{"$f":"IF('PB Liquefaction Initiation'!G17=\"\",\"\",'PB Liquefaction Initiation'!G17)","v":211.29568561199994},{"$f":"IF('PB Liquefaction Initiation'!H17=\"\",\"\",'PB Liquefaction Initiation'!H17)","v":105.18002281199995},-0.75778660808548748,8.4650490646487525E-2,0.83346524802694211,1.0457914390519785,9.0534712470771467E-2,0.99661941459480508,{"$f":"IF(Inputs!H20=\"\",1,Inputs!H20)","v":1},34.513477325439453,0.12990392170651952,0.9999999999999134,{"$f":"IF(OR(A17<$B$4,A17=\"\",Inputs!J20=\"No\",Method_BI=FALSE),NA(),0.65*($B$2*$B$3)*G17/H17*K17/L17/N17)","v":0.76226618833284232},9.9021367248716616E-2,1.1807183613071008]
[{"$f":"IF('PB Liquefaction Initiation'!A18=\"\",\"\",'PB Liquefaction Initiation'!A18)","v":12.4968},{"$f":"'PB Liquefaction Initiation'!B18","v":1.7282171422467403},{"$f":"IF('PB Liquefaction Initiation'!C18=\"\",\"\",'PB Liquefaction Initiation'!C18)","v":19.527529999999999},{"$f":"IF('PB Liquefaction Initiation'!D18=\"\",\"\",'PB Liquefaction Initiation'!D18)","v":70},{"$f":"IF('PB Liquefaction Initiation'!E18=\"\",\"\",'PB Liquefaction Initiation'!E18)","v":2.4384000000000001},{"$f":"IF(OR('PB Liquefaction Initiation'!F18=\"\",Method_BI=FALSE),NA(),'PB Liquefaction Initiation'!F18)","v":7.3030476983682764},{"$f":"IF('PB Liquefaction Initiation'!G18=\"\",\"\",'PB Liquefaction Initiation'!G18)","v":244.03163690399998},{"$f":"IF('PB Liquefaction Initiation'!H18=\"\",\"\",'PB Liquefaction Initiation'!H18)","v":121.47551930399997},-0.91661337100776497,0.10206979694341464,0.80048398595981718,1.0364244596501733,8.327198033305834E-2,0.98489616295200078,{"$f":"IF(Inputs!H21=\"\",1,Inputs!H21)","v":1},{"$error":"#N/A"},{"$error":"#N/A"},{"$error":"#N/A"},{"$f":"IF(OR(A18<$B$4,A18=\"\",Inputs!J21=\"No\",Method_BI=FALSE),NA(),0.65*($B$2*$B$3)*G18/H18*K18/L18/N18)","v":{"$error":"#N/A"}},8.6556517762789179E-2,1.1437510765277321]
[{"$f":"IF('PB Liquefaction Initiation'!A19=\"\",\"\",'PB Liquefaction Initiation'!A19)","v":13.715999999999999},{"$f":"'PB Liquefaction Initiation'!B19","v":1.6308342079976466},{"$f":"IF('PB Liquefaction Initiation'!C19=\"\",\"\",'PB Liquefaction Initiation'!C19)","v":19.527529999999999},{"$f":"IF('PB Liquefaction Initiation'!D19=\"\",\"\",'PB Liquefaction Initiation'!D19)","v":5},{"$f":"IF('PB Liquefaction Initiation'!E19=\"\",\"\",'PB Liquefaction Initiation'!E19)","v":0.91439999999999999},{"$f":"IF(OR('PB Liquefaction Initiation'!F19=\"\",Method_BI=FALSE),NA(),'PB Liquefaction Initiation'!F19)","v":1.6327566637818389},{"$f":"IF('PB Liquefaction Initiation'!G19=\"\",\"\",'PB Liquefaction Initiation'!G19)","v":267.83960147999994},{"$f":"IF('PB Liquefaction Initiation'!H19=\"\",\"\",'PB Liquefaction Initiation'!H19)","v":133.32678947999995},-1.0335324867780549,0.11481489329081636,0.77663001561404332,1.0234854836725904,6.3931971714297986E-2,0.98245259135142282,{"$f":"IF(Inputs!H22=\"\",1,Inputs!H22)","v":1},34.336931228637695,8.0170301250297227E-2,1,{"$f":"IF(OR(A19<$B$4,A19=\"\",Inputs!J22=\"No\",Method_BI=FALSE),NA(),0.65*($B$2*$B$3)*G19/H19*K19/L19/N19)","v":0.73623162212844251},5.902391093603223E-2,1.0926867163750307]
[{"$f":"IF('PB Liquefaction Initiation'!A20=\"\",\"\",'PB Liquefaction Initiation'!A20)","v":15.6972},{"$f":"'PB Liquefaction Initiation'!B20","v":9.6579991118717725},{"$f":"IF('PB Liquefaction Initiation'!C20=\"\",\"\",'PB Liquefaction Initiation'!C20)","v":19.527529999999999},{"$f":"IF('PB Liquefaction Initiation'!D20=\"\",\"\",'PB Liquefaction Initiation'!D20)","v":5},{"$f":"IF('PB Liquefaction Initiation'!E20=\"\",\"\",'PB Liquefaction Initiation'!E20)","v":2.1335999999999999},{"$f":"IF(OR('PB Liquefaction Initiation'!F20=\"\",Method_BI=FALSE),NA(),'PB Liquefaction Initiation'!F20)","v":9.6599215676559655},{"$f":"IF('PB Liquefaction Initiation'!G20=\"\",\"\",'PB Liquefaction Initiation'!G20)","v":306.52754391599996},{"$f":"IF('PB Liquefaction Initiation'!H20=\"\",\"\",'PB Liquefaction Initiation'!H20)","v":152.58510351599995},-1.2224702213186536,0.13524059073495981,0.73872156306117165,1.046633833826536,9.1120371397007682E-2,0.96269629277662172,{"$f":"IF(Inputs!H23=\"\",1,Inputs!H23)","v":1},34.066644668579102,0.14315320799813824,0.99999999999887046,{"$f":"IF(OR(A20<$B$4,A20=\"\",Inputs!J23=\"No\",Method_BI=FALSE),NA(),0.65*($B$2*$B$3)*G20/H20*K20/L20/N20)","v":0.69886017471582129},0.1000440759527092,1.1840429173023583]
[{"$f":"IF('PB Liquefaction Initiation'!A21=\"\",\"\",'PB Liquefaction Initiation'!A21)","v":17.3736},{"$f":"'PB Liquefaction Initiation'!B21","v":2.3739365564012611},{"$f":"IF('PB Liquefaction Initiation'!C21=\"\",\"\",'PB Liquefaction Initiation'!C21)","v":19.527529999999999},{"$f":"IF('PB Liquefaction Initiation'!D21=\"\",\"\",'PB Liquefaction Initiation'!D21)","v":5},{"$f":"IF('PB Liquefaction Initiation'!E21=\"\",\"\",'PB Liquefaction Initiation'!E21)","v":1.2192000000000001},{"$f":"IF(OR('PB Liquefaction Initiation'!F21=\"\",Method_BI=FALSE),NA(),'PB Liquefaction Initiation'!F21)","v":2.3758590121854533},{"$f":"IF('PB Liquefaction Initiation'!G21=\"\",\"\",'PB Liquefaction Initiation'!G21)","v":339.26349520799994},{"$f":"IF('PB Liquefaction Initiation'!H21=\"\",\"\",'PB Liquefaction Initiation'!H21)","v":168.88060000799993},-1.3778736310082447,0.15184564184324478,0.70799144657214785,1.024246167107276,6.6802607963325863E-2,0.9658733009354874,{"$f":"IF(Inputs!H24=\"\",1,Inputs!H24)","v":1},33.938884735107422,9.1164811049488759E-2,1,{"$f":"IF(OR(A21<$B$4,A21=\"\",Inputs!J24=\"No\",Method_BI=FALSE),NA(),0.65*($B$2*$B$3)*G21/H21*K21/L21/N21)","v":0.68217702333422126},6.2190539434566962E-2,1.0956887942008395]
[{"$f":"IF('PB Liquefaction Initiation'!A22=\"\",\"\",'PB Liquefaction Initiation'!A22)","v":""},{"$f":"'PB Liquefaction Initiation'!B22","v":""},{"$f":"IF('PB Liquefaction Initiation'!C22=\"\",\"\",'PB Liquefaction Initiation'!C22)","v":""},{"$f":"IF('PB Liquefaction Initiation'!D22=\"\",\"\",'PB Liquefaction Initiation'!D22)","v":""},{"$f":"IF('PB Liquefaction Initiation'!E22=\"\",\"\",'PB Liquefaction Initiation'!E22)","v":""},{"$f":"IF(OR('PB Liquefaction Initiation'!F22=\"\",Method_BI=FALSE),NA(),'PB Liquefaction Initiation'!F22)","v":{"$error":"#N/A"}},{"$f":"IF('PB Liquefaction Initiation'!G22=\"\",\"\",'PB Liquefaction Initiation'!G22)","v":""},{"$f":"IF('PB Liquefaction Initiation'!H22=\"\",\"\",'PB Liquefaction Initiation'!H22)","v":""},"","","","","","",{"$f":"IF(Inputs!H25=\"\",1,Inputs!H25)","v":1},{"$error":"#N/A"},{"$error":"#N/A"},{"$error":"#N/A"},{"$f":"IF(OR(A22<$B$4,A22=\"\",Inputs!J25=\"No\",Method_BI=FALSE),NA(),0.65*($B$2*$B$3)*G22/H22*K22/L22/N22)","v":{"$error":"#N/A"}},{"$error":"#N/A"},{"$error":"#N/A"}]
[{"$f":"IF('PB Liquefaction Initiation'!A23=\"\",\"\",'PB Liquefaction Initiation'!A23)","v":""},{"$f":"'PB Liquefaction Initiation'!B23","v":""},{"$f":"IF('PB Liquefaction Initiation'!C23=\"\",\"\",'PB Liquefaction Initiation'!C23)","v":""},{"$f":"IF('PB Liquefaction Initiation'!D23=\"\",\"\",'PB Liquefaction Initiation'!D23)","v":""},{"$f":"IF('PB Liquefaction Initiation'!E23=\"\",\"\",'PB Liquefaction Initiation'!E23)","v":""},{"$f":"IF(OR('PB Liquefaction Initiation'!F23=\"\",Method_BI=FALSE),NA(),'PB Liquefaction Initiation'!F23)","v":{"$error":"#N/A"}},{"$f":"IF('PB Liquefaction Initiation'!G23=\"\",\"\",'PB Liquefaction Initiation'!G23)","v":""},{"$f":"IF('PB Liquefaction Initiation'!H23=\"\",\"\",'PB Liquefaction Initiation'!H23)","v":""},"","","","","","",{"$f":"IF(Inputs!H26=\"\",1,Inputs!H26)","v":1},{"$error":"#N/A"},{"$error":"#N/A"},{"$error":"#N/A"},{"$f":"IF(OR(A23<$B$4,A23=\"\",Inputs!J26=\"No\",Method_BI=FALSE),NA(),0.65*($B$2*$B$3)*G23/H23*K23/L23/N23)","v":{"$error":"#N/A"}},{"$error":"#N/A"},{"$error":"#N/A"}]
[{"$f":"IF('PB Liquefaction Initiation'!A24=\"\",\"\",'PB Liquefaction Initiation'!A24)","v":""},{"$f":"'PB Liquefaction Initiation'!B24","v":""},{"$f":"IF('PB Liquefaction Initiation'!C24=\"\",\"\",'PB Liquefaction Initiation'!C24)","v":""},{"$f":"IF('PB Liquefaction Initiation'!D24=\"\",\"\",'PB Liquefaction Initiation'!D24)","v":""},{"$f":"IF('PB Liquefaction Initiation'!E24=\"\",\"\",'PB Liquefaction Initiation'!E24)","v":""},{"$f":"IF(OR('PB Liquefaction Initiation'!F24=\"\",Method_BI=FALSE),NA(),'PB Liquefaction Initiation'!F24)","v":{"$error":"#N/A"}},{"$f":"IF('PB Liquefaction Initiation'!G24=\"\",\"\",'PB Liquefaction Initiation'!G24)","v":""},{"$f":"IF('PB Liquefaction Initiation'!H24=\"\",\"\",'PB Liquefaction Initiation'!H24)","v":""},"","","","","","",{"$f":"IF(Inputs!H27=\"\",1,Inputs!H27)","v":1},{"$error":"#N/A"},{"$error":"#N/A"},{"$error":"#N/A"},{"$f":"IF(OR(A24<$B$4,A24=\"\",Inputs!J27=\"No\",Method_BI=FALSE),NA(),0.65*($B$2*$B$3)*G24/H24*K24/L24/N24)","v":{"$error":"#N/A"}},{"$error":"#N/A"},{"$error":"#N/A"}]
[{"$f":"IF('PB Liquefaction Initiation'!A25=\"\",\"\",'PB Liquefaction Initiation'!A25)","v":""},{"$f":"'PB Liquefaction Initiation'!B25","v":""},{"$f":"IF('PB Liquefaction Initiation'!C25=\"\",\"\",'PB Liquefaction Initiation'!C25)","v":""},{"$f":"IF('PB Liquefaction Initiation'!D25=\"\",\"\",'PB Liquefaction Initiation'!D25)","v":""},{"$f":"IF('PB Liquefaction Initiation'!E25=\"\",\"\",'PB Liquefaction Initiation'!E25)","v":""},{"$f":"IF(OR('PB Liquefaction Initiation'!F25=\"\",Method_BI=FALSE),NA(),'PB Liquefaction Initiation'!F25)","v":{"$error":"#N/A"}},{"$f":"IF('PB Liquefaction Initiation'!G25=\"\",\"\",'PB Liquefaction Initiation'!G25)","v":""},{"$f":"IF('PB Liquefaction Initiation'!H25=\"\",\"\",'PB Liquefaction Initiation'!H25)","v":""},"","","","","","",{"$f":"IF(Inputs!H28=\"\",1,Inputs!H28)","v":1},{"$error":"#N/A"},{"$error":"#N/A"},{"$error":"#N/A"},{"$f":"IF(OR(A25<$B$4,A25=\"\",Inputs!J28=\"No\",Method_BI=FALSE),NA(),0.65*($B$2*$B$3)*G25/H25*K25/L25/N25)","v":{"$error":"#N/A"}},{"$error":"#N/A"},{"$error":"#N/A"}]
[{"$f":"IF('PB Liquefaction Initiation'!A26=\"\",\"\",'PB Liquefaction Initiation'!A26)","v":""},{"$f":"'PB Liquefaction Initiation'!B26","v":""},{"$f":"IF('PB Liquefaction Initiation'!C26=\"\",\"\",'PB Liquefaction Initiation'!C26)","v":""},{"$f":"IF('PB Liquefaction Initiation'!D26=\"\",\"\",'PB Liquefaction Initiation'!D26)","v":""},{"$f":"IF('PB Liquefaction Initiation'!E26=\"\",\"\",'PB Liquefaction Initiation'!E26)","v":""},{"$f":"IF(OR('PB Liquefaction Initiation'!F26=\"\",Method_BI=FALSE),NA(),'PB Liquefaction Initiation'!F26)","v":{"$error":"#N/A"}},{"$f":"IF('PB Liquefaction Initiation'!G26=\"\",\"\",'PB Liquefaction Initiation'!G26)","v":""},{"$f":"IF('PB Liquefaction Initiation'!H26=\"\",\"\",'PB Liquefaction Initiation'!H26)","v":""},"","","","","","",{"$f":"IF(Inputs!H29=\"\",1,Inputs!H29)","v":1},{"$error":"#N/A"},{"$error":"#N/A"},{"$error":"#N/A"},{"$f":"IF(OR(A26<$B$4,A26=\"\",Inputs!J29=\"No\",Method_BI=FALSE),NA(),0.65*($B$2*$B$3)*G26/H26*K26/L26/N26)","v":{"$error":"#N/A"}},{"$error":"#N/A"},{"$error":"#N/A"}]
[{"$f":"IF('PB Liquefaction Initiation'!A27=\"\",\"\",'PB Liquefaction Initiation'!A27)","v":""},{"$f":"'PB Liquefaction Initiation'!B27","v":""},{"$f":"IF('PB Liquefaction Initiation'!C27=\"\",\"\",'PB Liquefaction Initiation'!C27)","v":""},{"$f":"IF('PB Liquefaction Initiation'!D27=\"\",\"\",'PB Liquefaction Initiation'!D27)","v":""},{"$f":"IF('PB Liquefaction Initiation'!E27=\"\",\"\",'PB Liquefaction Initiation'!E27)","v":""},{"$f":"IF(OR('PB Liquefaction Initiation'!F27=\"\",Method_BI=FALSE),NA(),'PB Liquefaction Initiation'!F27)","v":{"$error":"#N/A"}},{"$f":"IF('PB Liquefaction Initiation'!G27=\"\",\"\",'PB Liquefaction Initiation'!G27)","v":""},{"$f":"IF('PB Liquefaction Initiation'!H27=\"\",\"\",'PB Liquefaction Initiation'!H27)","v":""},"","","","","","",{"$f":"IF(Inputs!H30=\"\",1,Inputs!H30)","v":1},{"$error":"#N/A"},{"$error":"#N/A"},{"$error":"#N/A"},{"$f":"IF(OR(A27<$B$4,A27=\"\",Inputs!J30=\"No\",Method_BI=FALSE),NA(),0.65*($B$2*$B$3)*G27/H27*K27/L27/N27)","v":{"$error":"#N/A"}},{"$error":"#N/A"},{"$error":"#N/A"}]
[{"$f":"IF('PB Liquefaction Initiation'!A28=\"\",\"\",'PB Liquefaction Initiation'!A28)","v":""},{"$f":"'PB Liquefaction Initiation'!B28","v":""},{"$f":"IF('PB Liquefaction Initiation'!C28=\"\",\"\",'PB Liquefaction Initiation'!C28)","v":""},{"$f":"IF('PB Liquefaction Initiation'!D28=\"\",\"\",'PB Liquefaction Initiation'!D28)","v":""},{"$f":"IF('PB Liquefaction Initiation'!E28=\"\",\"\",'PB Liquefaction Initiation'!E28)","v":""},{"$f":"IF(OR('PB Liquefaction Initiation'!F28=\"\",Method_BI=FALSE),NA(),'PB Liquefaction Initiation'!F28)","v":{"$error":"#N/A"}},{"$f":"IF('PB Liquefaction Initiation'!G28=\"\",\"\",'PB Liquefaction Initiation'!G28)","v":""},{"$f":"IF('PB Liquefaction Initiation'!H28=\"\",\"\",'PB Liquefaction Initiation'!H28)","v":""},"","","","","","",{"$f":"IF(Inputs!H31=\"\",1,Inputs!H31)","v":1},{"$error":"#N/A"},{"$error":"#N/A"},{"$error":"#N/A"},{"$f":"IF(OR(A28<$B$4,A28=\"\",Inputs!J31=\"No\",Method_BI=FALSE),NA(),0.65*($B$2*$B$3)*G28/H28*K28/L28/N28)","v":{"$error":"#N/A"}},{"$error":"#N/A"},{"$error":"#N/A"}]
[{"$f":"IF('PB Liquefaction Initiation'!A29=\"\",\"\",'PB Liquefaction Initiation'!A29)","v":""},{"$f":"'PB Liquefaction Initiation'!B29","v":""},{"$f":"IF('PB Liquefaction Initiation'!C29=\"\",\"\",'PB Liquefaction Initiation'!C29)","v":""},{"$f":"IF('PB Liquefaction Initiation'!D29=\"\",\"\",'PB Liquefaction Initiation'!D29)","v":""},{"$f":"IF('PB Liquefaction Initiation'!E29=\"\",\"\",'PB Liquefaction Initiation'!E29)","v":""},{"$f":"IF(OR('PB Liquefaction Initiation'!F29=\"\",Method_BI=FALSE),NA(),'PB Liquefaction Initiation'!F29)","v":{"$error":"#N/A"}},{"$f":"IF('PB Liquefaction Initiation'!G29=\"\",\"\",'PB Liquefaction Initiation'!G29)","v":""},{"$f":"IF('PB Liquefaction Initiation'!H29=\"\",\"\",'PB Liquefaction Initiation'!H29)","v":""},"","","","","","",{"$f":"IF(Inputs!H32=\"\",1,Inputs!H32)","v":1},{"$error":"#N/A"},{"$error":"#N/A"},{"$error":"#N/A"},{"$f":"IF(OR(A29<$B$4,A29=\"\",Inputs!J32=\"No\",Method_BI=FALSE),NA(),0.65*($B$2*$B$3)*G29/H29*K29/L29/N29)","v":{"$error":"#N/A"}},{"$error":"#N/A"},{"$error":"#N/A"}]
[null,null,null,null,null,null,null,null,null,null,null,null,null,null,null,1]
[]
[]
[]
["Deterministic Triggering using Cetin et al. (2004)"]
[]
["PGA:",{"$f":"IF(PGA_det=\"\",NA(),PGA_det)","v":0.73},"g","amax =",{"$f":"B36*B37","v":0.73}]
["Fpga:",{"$f":"IF(Fpga_det=\"\",NA(),Fpga_det)","v":1}]
["Depth to Water:",{"$f":"'PB Liquefaction Initiation'!B38","v":0},"m"]
["Vs,12:",{"$f":"'PB Liquefaction Initiation'!B39","v":189.8904},"m/s"]
[]
["Mw:",{"$f":"Mw_det","v":6.8}]
["Depth:","(N1)60","g (kN/m3)","Fines (%)","Thickness (m)","(N1)60,cs","sv (kPa)","sv' (kPa)","rd","KDR(aging)","Nreqsite","FSL","PL","CSR(site)","CRR"]
[{"$f":"IF('PB Liquefaction Initiation'!A10=\"\",\"\",'PB Liquefaction Initiation'!A10)","v":0.4572},{"$f":"IF('PB Liquefaction Initiation'!B43=\"\",\"\",'PB Liquefaction Initiation'!B43)","v":30.800000000000004},{"$f":"IF('PB Liquefaction Initiation'!C10=\"\",\"\",'PB Liquefaction Initiation'!C10)","v":19.527529999999999},{"$f":"IF('PB Liquefaction Initiation'!D10=\"\",\"\",'PB Liquefaction Initiation'!D10)","v":10},{"$f":"IF('PB Liquefaction Initiation'!E10=\"\",\"\",'PB Liquefaction Initiation'!E10)","v":0.91439999999999999},{"$f":"IF(OR(A43=\"\",Method_Cetin=FALSE),NA(),IF(D43<5,B43,IF(D43>35,B43*(1+0.004*35)+0.06*35,B43*(1+0.004*D43)+0.06*D43)))","v":32.632000000000005},{"$f":"IF(A43=\"\",\"\",C43*A43)","v":8.9279867159999995},{"$f":"IF(A43=\"\",\"\",IF(A43<$B$4,G43,G43-(A43-$B$4)*9.81))","v":4.4428547159999994},{"$f":"IF(OR(A43<$B$38,A43=\"\"),\"\",IF(A43<20,(1+((-23.013)-2.949*$E$36+0.999*$B$41+0.0525*$B$39)/(16.258+0.201*EXP(0.341*((-A43*0.3048)+0.0785*$B$39+7.586))))/(1+((-23.013)-2.949*$E$36+0.999*$B$41+0.0525*$B$39)/(16.258+0.201*EXP(0.341*(0.0785*$B$39+7.586)))),(1+((-23.013)-2.949*$E$36+0.999*$B$41+0.0525*$B$39)/(16.258+0.201*EXP(0.341*((-20*0.3048)+0.0785*$B$39+7.586))))/(1+((-23.013)-2.949*$E$36+0.999*$B$41+0.0525*$B$39)/(16.258+0.201*EXP(0.341*(0.0785*$B$39+7.586))))-0.0046*(A43-20)))","v":0.99910301707519145},{"$f":"IF(Inputs!H13=\"\",1,Inputs!H13)","v":1},{"$f":"IF(OR(A43<$B$38,A43=\"\",Inputs!J13=\"No\",Method_Cetin=FALSE),NA(),13.79*LN(0.65*$B$37*$B$36*G43/H43*I43)+29.06*LN($B$41)+3.82*LN(H43/101.325)-15.25-4.21*_xlfn.NORM.S.INV(1-Percentile_Liq/100))","v":32.02838398000322},{"$f":"IF(OR(A43<$B$38,A43=\"\",Method_Cetin=FALSE),NA(),O43/N43)","v":1.6810605542142403},{"$f":"IF(OR(A43<$B$38,A43=\"\",Method_Cetin=FALSE),NA(),_xlfn.NORM.S.DIST(-(B43*(1+0.004*D43)-13.79*LN(N43)-29.06*LN($B$41)-3.82*LN(H43/101.325)+0.06*D43+16.85)/4.21,TRUE))","v":6.4522059586467645E-2},{"$f":"IF(OR(A43<$B$38,A43=\"\",Inputs!J13=\"No\",Method_Cetin=FALSE),NA(),$E$36*0.65*G43/H43*I43)","v":0.95265995669352044},{"$f":"IF(OR(A43=\"\",Method_Cetin=FALSE),NA(),J43*EXP((F43-29.06*LN($B$41)-3.82*LN(H43/101.325)+15.25+4.21*_xlfn.NORM.S.DIST((1-Percentile_Liq/100),TRUE))/13.79))","v":1.6014790747769236}]
[{"$f":"IF('PB Liquefaction Initiation'!A11=\"\",\"\",'PB Liquefaction Initiation'!A11)","v":1.6763999999999999},{"$f":"IF('PB Liquefaction Initiation'!B44=\"\",\"\",'PB Liquefaction Initiation'!B44)","v":9.6360496090214056},{"$f":"IF('PB Liquefaction Initiation'!C11=\"\",\"\",'PB Liquefaction Initiation'!C11)","v":19.527529999999999},{"$f":"IF('PB Liquefaction Initiation'!D11=\"\",\"\",'PB Liquefaction Initiation'!D11)","v":10},{"$f":"IF('PB Liquefaction Initiation'!E11=\"\",\"\",'PB Liquefaction Initiation'!E11)","v":1.524},10.621491593382261,{"$f":"IF(A44=\"\",\"\",C44*A44)","v":32.735951291999996},{"$f":"IF(A44=\"\",\"\",IF(A44<$B$4,G44,G44-(A44-$B$4)*9.81))","v":16.290467291999995},{"$f":"IF(OR(A44<$B$38,A44=\"\"),\"\",IF(A44<20,(1+((-23.013)-2.949*$E$36+0.999*$B$41+0.0525*$B$39)/(16.258+0.201*EXP(0.341*((-A44*0.3048)+0.0785*$B$39+7.586))))/(1+((-23.013)-2.949*$E$36+0.999*$B$41+0.0525*$B$39)/(16.258+0.201*EXP(0.341*(0.0785*$B$39+7.586)))),(1+((-23.013)-2.949*$E$36+0.999*$B$41+0.0525*$B$39)/(16.258+0.201*EXP(0.341*((-20*0.3048)+0.0785*$B$39+7.586))))/(1+((-23.013)-2.949*$E$36+0.999*$B$41+0.0525*$B$39)/(16.258+0.201*EXP(0.341*(0.0785*$B$39+7.586))))-0.0046*(A44-20)))","v":0.99650978221041719},{"$f":"IF(Inputs!H14=\"\",1,Inputs!H14)","v":1},{"$f":"IF(OR(A44<$B$38,A44=\"\",Inputs!J14=\"No\",Method_Cetin=FALSE),NA(),13.79*LN(0.65*$B$37*$B$36*G44/H44*I44)+29.06*LN($B$41)+3.82*LN(H44/101.325)-15.25-4.21*_xlfn.NORM.S.INV(1-Percentile_Liq/100))","v":36.955805633264397},0.23835012409072004,0.99999947138618306,{"$f":"IF(OR(A44<$B$38,A44=\"\",Inputs!J14=\"No\",Method_Cetin=FALSE),NA(),$E$36*0.65*G44/H44*I44)","v":0.9501872677197607},0.22647725317042719]
[{"$f":"IF('PB Liquefaction Initiation'!A12=\"\",\"\",'PB Liquefaction Initiation'!A12)","v":3.2004000000000001},{"$f":"IF('PB Liquefaction Initiation'!B45=\"\",\"\",'PB Liquefaction Initiation'!B45)","v":12.235900757697163},{"$f":"IF('PB Liquefaction Initiation'!C12=\"\",\"\",'PB Liquefaction Initiation'!C12)","v":19.527529999999999},{"$f":"IF('PB Liquefaction Initiation'!D12=\"\",\"\",'PB Liquefaction Initiation'!D12)","v":10},{"$f":"IF('PB Liquefaction Initiation'!E12=\"\",\"\",'PB Liquefaction Initiation'!E12)","v":1.524},13.32533678800505,62.495907011999996,31.099983011999992,0.99281655092850041,{"$f":"IF(Inputs!H15=\"\",1,Inputs!H15)","v":1},{"$f":"IF(OR(A45<$B$38,A45=\"\",Inputs!J15=\"No\",Method_Cetin=FALSE),NA(),13.79*LN(0.65*$B$37*$B$36*G45/H45*I45)+29.06*LN($B$41)+3.82*LN(H45/101.325)-15.25-4.21*_xlfn.NORM.S.INV(1-Percentile_Liq/100))","v":39.374718423613992},0.24332620501597385,0.99999925657936395,{"$f":"IF(OR(A45<$B$38,A45=\"\",Inputs!J15=\"No\",Method_Cetin=FALSE),NA(),$E$36*0.65*G45/H45*I45)","v":0.94666571539436606},0.23034857594564306]
[{"$f":"IF('PB Liquefaction Initiation'!A13=\"\",\"\",'PB Liquefaction Initiation'!A13)","v":4.5720000000000001},{"$f":"IF('PB Liquefaction Initiation'!B46=\"\",\"\",'PB Liquefaction Initiation'!B46)","v":1.6947589772898803},{"$f":"IF('PB Liquefaction Initiation'!C13=\"\",\"\",'PB Liquefaction Initiation'!C13)","v":19.527529999999999},{"$f":"IF('PB Liquefaction Initiation'!D13=\"\",\"\",'PB Liquefaction Initiation'!D13)","v":60},{"$f":"IF('PB Liquefaction Initiation'!E13=\"\",\"\",'PB Liquefaction Initiation'!E13)","v":1.2192000000000001},4.0320252341104634,89.279867159999995,44.428547159999994,0.98901109419727962,{"$f":"IF(Inputs!H16=\"\",1,Inputs!H16)","v":1},{"$f":"IF(OR(A46<$B$38,A46=\"\",Inputs!J16=\"No\",Method_Cetin=FALSE),NA(),13.79*LN(0.65*$B$37*$B$36*G46/H46*I46)+29.06*LN($B$41)+3.82*LN(H46/101.325)-15.25-4.21*_xlfn.NORM.S.INV(1-Percentile_Liq/100))","v":{"$error":"#N/A"}},{"$error":"#N/A"},{"$error":"#N/A"},{"$f":"IF(OR(A46<$B$38,A46=\"\",Inputs!J16=\"No\",Method_Cetin=FALSE),NA(),$E$36*0.65*G46/H46*I46)","v":{"$error":"#N/A"}},0.10636468711797432]
[{"$f":"IF('PB Liquefaction Initiation'!A14=\"\",\"\",'PB Liquefaction Initiation'!A14)","v":6.2484000000000002},{"$f":"IF('PB Liquefaction Initiation'!B47=\"\",\"\",'PB Liquefaction Initiation'!B47)","v":20.814634562240858},{"$f":"IF('PB Liquefaction Initiation'!C14=\"\",\"\",'PB Liquefaction Initiation'!C14)","v":19.527529999999999},{"$f":"IF('PB Liquefaction Initiation'!D14=\"\",\"\",'PB Liquefaction Initiation'!D14)","v":10},{"$f":"IF('PB Liquefaction Initiation'!E14=\"\",\"\",'PB Liquefaction Initiation'!E14)","v":2.1335999999999999},22.247219944730496,122.01581845199999,60.719014451999989,0.98365917097895583,{"$f":"IF(Inputs!H17=\"\",1,Inputs!H17)","v":1},{"$f":"IF(OR(A47<$B$38,A47=\"\",Inputs!J17=\"No\",Method_Cetin=FALSE),NA(),13.79*LN(0.65*$B$37*$B$36*G47/H47*I47)+29.06*LN($B$41)+3.82*LN(H47/101.325)-15.25-4.21*_xlfn.NORM.S.INV(1-Percentile_Liq/100))","v":41.802703817817168},0.38967633874842733,0.99946321733094867,{"$f":"IF(OR(A47<$B$38,A47=\"\",Inputs!J17=\"No\",Method_Cetin=FALSE),NA(),$E$36*0.65*G47/H47*I47)","v":0.93793401402117049},0.36549069257138583]
[{"$f":"IF('PB Liquefaction Initiation'!A15=\"\",\"\",'PB Liquefaction Initiation'!A15)","v":7.7724000000000002},{"$f":"IF('PB Liquefaction Initiation'!B48=\"\",\"\",'PB Liquefaction Initiation'!B48)","v":28.679310145415499},{"$f":"IF('PB Liquefaction Initiation'!C15=\"\",\"\",'PB Liquefaction Initiation'!C15)","v":19.527529999999999},{"$f":"IF('PB Liquefaction Initiation'!D15=\"\",\"\",'PB Liquefaction Initiation'!D15)","v":10},{"$f":"IF('PB Liquefaction Initiation'!E15=\"\",\"\",'PB Liquefaction Initiation'!E15)","v":0.91439999999999999},30.426482551232123,151.77577417199998,75.528530171999975,0.97804153841327601,{"$f":"IF(Inputs!H18=\"\",1,Inputs!H18)","v":1},{"$f":"IF(OR(A48<$B$38,A48=\"\",Inputs!J18=\"No\",Method_Cetin=FALSE),NA(),13.79*LN(0.65*$B$37*$B$36*G48/H48*I48)+29.06*LN($B$41)+3.82*LN(H48/101.325)-15.25-4.21*_xlfn.NORM.S.INV(1-Percentile_Liq/100))","v":42.55745264001893},0.6676171516200663,0.93408956914845576,{"$f":"IF(OR(A48<$B$38,A48=\"\",Inputs!J18=\"No\",Method_Cetin=FALSE),NA(),$E$36*0.65*G48/H48*I48)","v":0.93257751573693215},0.62260474472120819]
[{"$f":"IF('PB Liquefaction Initiation'!A16=\"\",\"\",'PB Liquefaction Initiation'!A16)","v":9.2964000000000002},{"$f":"IF('PB Liquefaction Initiation'!B49=\"\",\"\",'PB Liquefaction Initiation'!B49)","v":19.503974728605119},{"$f":"IF('PB Liquefaction Initiation'!C16=\"\",\"\",'PB Liquefaction Initiation'!C16)","v":19.527529999999999},{"$f":"IF('PB Liquefaction Initiation'!D16=\"\",\"\",'PB Liquefaction Initiation'!D16)","v":10},{"$f":"IF('PB Liquefaction Initiation'!E16=\"\",\"\",'PB Liquefaction Initiation'!E16)","v":2.1335999999999999},20.884133717749325,181.53572989200001,90.338045891999997,0.97162100701625675,{"$f":"IF(Inputs!H19=\"\",1,Inputs!H19)","v":1},{"$f":"IF(OR(A49<$B$38,A49=\"\",Inputs!J19=\"No\",Method_Cetin=FALSE),NA(),13.79*LN(0.65*$B$37*$B$36*G49/H49*I49)+29.06*LN($B$41)+3.82*LN(H49/101.325)-15.25-4.21*_xlfn.NORM.S.INV(1-Percentile_Liq/100))","v":43.150591476199544},0.32012983712466553,0.99995469276306848,{"$f":"IF(OR(A49<$B$38,A49=\"\",Inputs!J19=\"No\",Method_Cetin=FALSE),NA(),$E$36*0.65*G49/H49*I49)","v":0.92645544117795442},0.29658602948755869]
[{"$f":"IF('PB Liquefaction Initiation'!A17=\"\",\"\",'PB Liquefaction Initiation'!A17)","v":10.820399999999999},{"$f":"IF('PB Liquefaction Initiation'!B50=\"\",\"\",'PB Liquefaction Initiation'!B50)","v":8.222572974280391},{"$f":"IF('PB Liquefaction Initiation'!C17=\"\",\"\",'PB Liquefaction Initiation'!C17)","v":19.527529999999999},{"$f":"IF('PB Liquefaction Initiation'!D17=\"\",\"\",'PB Liquefaction Initiation'!D17)","v":10},{"$f":"IF('PB Liquefaction Initiation'!E17=\"\",\"\",'PB Liquefaction Initiation'!E17)","v":0.91439999999999999},9.1514758932516074,211.29568561199997,105.14756161199998,0.96431116601021072,{"$f":"IF(Inputs!H20=\"\",1,Inputs!H20)","v":1},{"$f":"IF(OR(A50<$B$38,A50=\"\",Inputs!J20=\"No\",Method_Cetin=FALSE),NA(),13.79*LN(0.65*$B$37*$B$36*G50/H50*I50)+29.06*LN($B$41)+3.82*LN(H50/101.325)-15.25-4.21*_xlfn.NORM.S.INV(1-Percentile_Liq/100))","v":43.626351273603085},0.13208123927108129,0.9999999999952639,{"$f":"IF(OR(A50<$B$38,A50=\"\",Inputs!J20=\"No\",Method_Cetin=FALSE),NA(),$E$36*0.65*G50/H50*I50)","v":0.91948539635050286},0.12144677064163578]
[{"$f":"IF('PB Liquefaction Initiation'!A18=\"\",\"\",'PB Liquefaction Initiation'!A18)","v":12.4968},{"$f":"IF('PB Liquefaction Initiation'!B51=\"\",\"\",'PB Liquefaction Initiation'!B51)","v":1.7936216801192344},{"$f":"IF('PB Liquefaction Initiation'!C18=\"\",\"\",'PB Liquefaction Initiation'!C18)","v":19.527529999999999},{"$f":"IF('PB Liquefaction Initiation'!D18=\"\",\"\",'PB Liquefaction Initiation'!D18)","v":70},{"$f":"IF('PB Liquefaction Initiation'!E18=\"\",\"\",'PB Liquefaction Initiation'!E18)","v":2.4384000000000001},4.144728715335928,244.03163690399998,121.43802890399998,0.95513990073036703,{"$f":"IF(Inputs!H21=\"\",1,Inputs!H21)","v":1},{"$f":"IF(OR(A51<$B$38,A51=\"\",Inputs!J21=\"No\",Method_Cetin=FALSE),NA(),13.79*LN(0.65*$B$37*$B$36*G51/H51*I51)+29.06*LN($B$41)+3.82*LN(H51/101.325)-15.25-4.21*_xlfn.NORM.S.INV(1-Percentile_Liq/100))","v":{"$error":"#N/A"}},{"$error":"#N/A"},{"$error":"#N/A"},{"$f":"IF(OR(A51<$B$38,A51=\"\",Inputs!J21=\"No\",Method_Cetin=FALSE),NA(),$E$36*0.65*G51/H51*I51)","v":{"$error":"#N/A"}},8.1166656004397583E-2]
[{"$f":"IF('PB Liquefaction Initiation'!A19=\"\",\"\",'PB Liquefaction Initiation'!A19)","v":13.715999999999999},{"$f":"IF('PB Liquefaction Initiation'!B52=\"\",\"\",'PB Liquefaction Initiation'!B52)","v":1.7286856333565144},{"$f":"IF('PB Liquefaction Initiation'!C19=\"\",\"\",'PB Liquefaction Initiation'!C19)","v":19.527529999999999},{"$f":"IF('PB Liquefaction Initiation'!D19=\"\",\"\",'PB Liquefaction Initiation'!D19)","v":5},{"$f":"IF('PB Liquefaction Initiation'!E19=\"\",\"\",'PB Liquefaction Initiation'!E19)","v":0.91439999999999999},2.0632593460236448,267.83960147999994,133.28564147999995,0.9476646699447463,{"$f":"IF(Inputs!H22=\"\",1,Inputs!H22)","v":1},{"$f":"IF(OR(A52<$B$38,A52=\"\",Inputs!J22=\"No\",Method_Cetin=FALSE),NA(),13.79*LN(0.65*$B$37*$B$36*G52/H52*I52)+29.06*LN($B$41)+3.82*LN(H52/101.325)-15.25-4.21*_xlfn.NORM.S.INV(1-Percentile_Liq/100))","v":44.292057499753916},7.5273734828321059E-2,1,{"$f":"IF(OR(A52<$B$38,A52=\"\",Inputs!J22=\"No\",Method_Cetin=FALSE),NA(),$E$36*0.65*G52/H52*I52)","v":0.90361270859979537},6.8018303414641948E-2]
[{"$f":"IF('PB Liquefaction Initiation'!A20=\"\",\"\",'PB Liquefaction Initiation'!A20)","v":15.6972},{"$f":"IF('PB Liquefaction Initiation'!B53=\"\",\"\",'PB Liquefaction Initiation'!B53)","v":9.826321161529588},{"$f":"IF('PB Liquefaction Initiation'!C20=\"\",\"\",'PB Liquefaction Initiation'!C20)","v":19.527529999999999},{"$f":"IF('PB Liquefaction Initiation'!D20=\"\",\"\",'PB Liquefaction Initiation'!D20)","v":5},{"$f":"IF('PB Liquefaction Initiation'!E20=\"\",\"\",'PB Liquefaction Initiation'!E20)","v":2.1335999999999999},10.322847584760181,306.52754391600001,152.53801191599999,0.93396088435895774,{"$f":"IF(Inputs!H23=\"\",1,Inputs!H23)","v":1},{"$f":"IF(OR(A53<$B$38,A53=\"\",Inputs!J23=\"No\",Method_Cetin=FALSE),NA(),13.79*LN(0.65*$B$37*$B$36*G53/H53*I53)+29.06*LN($B$41)+3.82*LN(H53/101.325)-15.25-4.21*_xlfn.NORM.S.INV(1-Percentile_Liq/100))","v":44.606581970585999},0.13392474304154969,0.99999999999351175,{"$f":"IF(OR(A53<$B$38,A53=\"\",Inputs!J23=\"No\",Method_Cetin=FALSE),NA(),$E$36*0.65*G53/H53*I53)","v":0.89054594014891797},0.11926613620113914]
[{"$f":"IF('PB Liquefaction Initiation'!A21=\"\",\"\",'PB Liquefaction Initiation'!A21)","v":17.3736},{"$f":"IF('PB Liquefaction Initiation'!B54=\"\",\"\",'PB Liquefaction Initiation'!B54)","v":2.6196491173635703},{"$f":"IF('PB Liquefaction Initiation'!C21=\"\",\"\",'PB Liquefaction Initiation'!C21)","v":19.527529999999999},{"$f":"IF('PB Liquefaction Initiation'!D21=\"\",\"\",'PB Liquefaction Initiation'!D21)","v":5},{"$f":"IF('PB Liquefaction Initiation'!E21=\"\",\"\",'PB Liquefaction Initiation'!E21)","v":1.2192000000000001},2.9720420997108414,339.26349520799999,168.82847920799998,0.92077280565726383,{"$f":"IF(Inputs!H24=\"\",1,Inputs!H24)","v":1},{"$f":"IF(OR(A54<$B$38,A54=\"\",Inputs!J24=\"No\",Method_Cetin=FALSE),NA(),13.79*LN(0.65*$B$37*$B$36*G54/H54*I54)+29.06*LN($B$41)+3.82*LN(H54/101.325)-15.25-4.21*_xlfn.NORM.S.INV(1-Percentile_Liq/100))","v":44.798084490646112},7.7504626482994235E-2,1,{"$f":"IF(OR(A54<$B$38,A54=\"\",Inputs!J24=\"No\",Method_Cetin=FALSE),NA(),$E$36*0.65*G54/H54*I54)","v":0.87797090607324668},6.8046807138142998E-2]
[{"$f":"IF('PB Liquefaction Initiation'!A22=\"\",\"\",'PB Liquefaction Initiation'!A22)","v":""},{"$f":"IF('PB Liquefaction Initiation'!B55=\"\",\"\",'PB Liquefaction Initiation'!B55)","v":""},{"$f":"IF('PB Liquefaction Initiation'!C22=\"\",\"\",'PB Liquefaction Initiation'!C22)","v":""},{"$f":"IF('PB Liquefaction Initiation'!D22=\"\",\"\",'PB Liquefaction Initiation'!D22)","v":""},{"$f":"IF('PB Liquefaction Initiation'!E22=\"\",\"\",'PB Liquefaction Initiation'!E22)","v":""},{"$error":"#N/A"},"","","",{"$f":"IF(Inputs!H25=\"\",1,Inputs!H25)","v":1},{"$f":"IF(OR(A55<$B$38,A55=\"\",Inputs!J25=\"No\",Method_Cetin=FALSE),NA(),13.79*LN(0.65*$B$37*$B$36*G55/H55*I55)+29.06*LN($B$41)+3.82*LN(H55/101.325)-15.25-4.21*_xlfn.NORM.S.INV(1-Percentile_Liq/100))","v":{"$error":"#N/A"}},{"$error":"#N/A"},{"$error":"#N/A"},{"$f":"IF(OR(A55<$B$38,A55=\"\",Inputs!J25=\"No\",Method_Cetin=FALSE),NA(),$E$36*0.65*G55/H55*I55)","v":{"$error":"#N/A"}},{"$error":"#N/A"}]
[{"$f":"IF('PB Liquefaction Initiation'!A23=\"\",\"\",'PB Liquefaction Initiation'!A23)","v":""},{"$f":"IF('PB Liquefaction Initiation'!B56=\"\",\"\",'PB Liquefaction Initiation'!B56)","v":""},{"$f":"IF('PB Liquefaction Initiation'!C23=\"\",\"\",'PB Liquefaction Initiation'!C23)","v":""},{"$f":"IF('PB Liquefaction Initiation'!D23=\"\",\"\",'PB Liquefaction Initiation'!D23)","v":""},{"$f":"IF('PB Liquefaction Initiation'!E23=\"\",\"\",'PB Liquefaction Initiation'!E23)","v":""},{"$error":"#N/A"},"","","",{"$f":"IF(Inputs!H26=\"\",1,Inputs!H26)","v":1},{"$f":"IF(OR(A56<$B$38,A56=\"\",Inputs!J26=\"No\",Method_Cetin=FALSE),NA(),13.79*LN(0.65*$B$37*$B$36*G56/H56*I56)+29.06*LN($B$41)+3.82*LN(H56/101.325)-15.25-4.21*_xlfn.NORM.S.INV(1-Percentile_Liq/100))","v":{"$error":"#N/A"}},{"$error":"#N/A"},{"$error":"#N/A"},{"$f":"IF(OR(A56<$B$38,A56=\"\",Inputs!J26=\"No\",Method_Cetin=FALSE),NA(),$E$36*0.65*G56/H56*I56)","v":{"$error":"#N/A"}},{"$error":"#N/A"}]
[{"$f":"IF('PB Liquefaction Initiation'!A24=\"\",\"\",'PB Liquefaction Initiation'!A24)","v":""},{"$f":"IF('PB Liquefaction Initiation'!B57=\"\",\"\",'PB Liquefaction Initiation'!B57)","v":""},{"$f":"IF('PB Liquefaction Initiation'!C24=\"\",\"\",'PB Liquefaction Initiation'!C24)","v":""},{"$f":"IF('PB Liquefaction Initiation'!D24=\"\",\"\",'PB Liquefaction Initiation'!D24)","v":""},{"$f":"IF('PB Liquefaction Initiation'!E24=\"\",\"\",'PB Liquefaction Initiation'!E24)","v":""},{"$error":"#N/A"},"","","",{"$f":"IF(Inputs!H27=\"\",1,Inputs!H27)","v":1},{"$f":"IF(OR(A57<$B$38,A57=\"\",Inputs!J27=\"No\",Method_Cetin=FALSE),NA(),13.79*LN(0.65*$B$37*$B$36*G57/H57*I57)+29.06*LN($B$41)+3.82*LN(H57/101.325)-15.25-4.21*_xlfn.NORM.S.INV(1-Percentile_Liq/100))","v":{"$error":"#N/A"}},{"$error":"#N/A"},{"$error":"#N/A"},{"$f":"IF(OR(A57<$B$38,A57=\"\",Inputs!J27=\"No\",Method_Cetin=FALSE),NA(),$E$36*0.65*G57/H57*I57)","v":{"$error":"#N/A"}},{"$error":"#N/A"}]
[{"$f":"IF('PB Liquefaction Initiation'!A25=\"\",\"\",'PB Liquefaction Initiation'!A25)","v":""},{"$f":"IF('PB Liquefaction Initiation'!B58=\"\",\"\",'PB Liquefaction Initiation'!B58)","v":""},{"$f":"IF('PB Liquefaction Initiation'!C25=\"\",\"\",'PB Liquefaction Initiation'!C25)","v":""},{"$f":"IF('PB Liquefaction Initiation'!D25=\"\",\"\",'PB Liquefaction Initiation'!D25)","v":""},{"$f":"IF('PB Liquefaction Initiation'!E25=\"\",\"\",'PB Liquefaction Initiation'!E25)","v":""},{"$error":"#N/A"},"","","",{"$f":"IF(Inputs!H28=\"\",1,Inputs!H28)","v":1},{"$f":"IF(OR(A58<$B$38,A58=\"\",Inputs!J28=\"No\",Method_Cetin=FALSE),NA(),13.79*LN(0.65*$B$37*$B$36*G58/H58*I58)+29.06*LN($B$41)+3.82*LN(H58/101.325)-15.25-4.21*_xlfn.NORM.S.INV(1-Percentile_Liq/100))","v":{"$error":"#N/A"}},{"$error":"#N/A"},{"$error":"#N/A"},{"$f":"IF(OR(A58<$B$38,A58=\"\",Inputs!J28=\"No\",Method_Cetin=FALSE),NA(),$E$36*0.65*G58/H58*I58)","v":{"$error":"#N/A"}},{"$error":"#N/A"}]
[{"$f":"IF('PB Liquefaction Initiation'!A26=\"\",\"\",'PB Liquefaction Initiation'!A26)","v":""},{"$f":"IF('PB Liquefaction Initiation'!B59=\"\",\"\",'PB Liquefaction Initiation'!B59)","v":""},{"$f":"IF('PB Liquefaction Initiation'!C26=\"\",\"\",'PB Liquefaction Initiation'!C26)","v":""},{"$f":"IF('PB Liquefaction Initiation'!D26=\"\",\"\",'PB Liquefaction Initiation'!D26)","v":""},{"$f":"IF('PB Liquefaction Initiation'!E26=\"\",\"\",'PB Liquefaction Initiation'!E26)","v":""},{"$error":"#N/A"},"","","",{"$f":"IF(Inputs!H29=\"\",1,Inputs!H29)","v":1},{"$f":"IF(OR(A59<$B$38,A59=\"\",Inputs!J29=\"No\",Method_Cetin=FALSE),NA(),13.79*LN(0.65*$B$37*$B$36*G59/H59*I59)+29.06*LN($B$41)+3.82*LN(H59/101.325)-15.25-4.21*_xlfn.NORM.S.INV(1-Percentile_Liq/100))","v":{"$error":"#N/A"}},{"$error":"#N/A"},{"$error":"#N/A"},{"$f":"IF(OR(A59<$B$38,A59=\"\",Inputs!J29=\"No\",Method_Cetin=FALSE),NA(),$E$36*0.65*G59/H59*I59)","v":{"$error":"#N/A"}},{"$error":"#N/A"}]
[{"$f":"IF('PB Liquefaction Initiation'!A27=\"\",\"\",'PB Liquefaction Initiation'!A27)","v":""},{"$f":"IF('PB Liquefaction Initiation'!B60=\"\",\"\",'PB Liquefaction Initiation'!B60)","v":""},{"$f":"IF('PB Liquefaction Initiation'!C27=\"\",\"\",'PB Liquefaction Initiation'!C27)","v":""},{"$f":"IF('PB Liquefaction Initiation'!D27=\"\",\"\",'PB Liquefaction Initiation'!D27)","v":""},{"$f":"IF('PB Liquefaction Initiation'!E27=\"\",\"\",'PB Liquefaction Initiation'!E27)","v":""},{"$error":"#N/A"},"","","",{"$f":"IF(Inputs!H30=\"\",1,Inputs!H30)","v":1},{"$f":"IF(OR(A60<$B$38,A60=\"\",Inputs!J30=\"No\",Method_Cetin=FALSE),NA(),13.79*LN(0.65*$B$37*$B$36*G60/H60*I60)+29.06*LN($B$41)+3.82*LN(H60/101.325)-15.25-4.21*_xlfn.NORM.S.INV(1-Percentile_Liq/100))","v":{"$error":"#N/A"}},{"$error":"#N/A"},{"$error":"#N/A"},{"$f":"IF(OR(A60<$B$38,A60=\"\",Inputs!J30=\"No\",Method_Cetin=FALSE),NA(),$E$36*0.65*G60/H60*I60)","v":{"$error":"#N/A"}},{"$error":"#N/A"}]
[{"$f":"IF('PB Liquefaction Initiation'!A28=\"\",\"\",'PB Liquefaction Initiation'!A28)","v":""},{"$f":"IF('PB Liquefaction Initiation'!B61=\"\",\"\",'PB Liquefaction Initiation'!B61)","v":""},{"$f":"IF('PB Liquefaction Initiation'!C28=\"\",\"\",'PB Liquefaction Initiation'!C28)","v":""},{"$f":"IF('PB Liquefaction Initiation'!D28=\"\",\"\",'PB Liquefaction Initiation'!D28)","v":""},{"$f":"IF('PB Liquefaction Initiation'!E28=\"\",\"\",'PB Liquefaction Initiation'!E28)","v":""},{"$error":"#N/A"},"","","",{"$f":"IF(Inputs!H31=\"\",1,Inputs!H31)","v":1},{"$f":"IF(OR(A61<$B$38,A61=\"\",Inputs!J31=\"No\",Method_Cetin=FALSE),NA(),13.79*LN(0.65*$B$37*$B$36*G61/H61*I61)+29.06*LN($B$41)+3.82*LN(H61/101.325)-15.25-4.21*_xlfn.NORM.S.INV(1-Percentile_Liq/100))","v":{"$error":"#N/A"}},{"$error":"#N/A"},{"$error":"#N/A"},{"$f":"IF(OR(A61<$B$38,A61=\"\",Inputs!J31=\"No\",Method_Cetin=FALSE),NA(),$E$36*0.65*G61/H61*I61)","v":{"$error":"#N/A"}},{"$error":"#N/A"}]
[{"$f":"IF('PB Liquefaction Initiation'!A29=\"\",\"\",'PB Liquefaction Initiation'!A29)","v":""},{"$f":"IF('PB Liquefaction Initiation'!B62=\"\",\"\",'PB Liquefaction Initiation'!B62)","v":""},{"$f":"IF('PB Liquefaction Initiation'!C29=\"\",\"\",'PB Liquefaction Initiation'!C29)","v":""},{"$f":"IF('PB Liquefaction Initiation'!D29=\"\",\"\",'PB Liquefaction Initiation'!D29)","v":""},{"$f":"IF('PB Liquefaction Initiation'!E29=\"\",\"\",'PB Liquefaction Initiation'!E29)","v":""},{"$error":"#N/A"},"","","",{"$f":"IF(Inputs!H32=\"\",1,Inputs!H32)","v":1},{"$f":"IF(OR(A62<$B$38,A62=\"\",Inputs!J32=\"No\",Method_Cetin=FALSE),NA(),13.79*LN(0.65*$B$37*$B$36*G62/H62*I62)+29.06*LN($B$41)+3.82*LN(H62/101.325)-15.25-4.21*_xlfn.NORM.S.INV(1-Percentile_Liq/100))","v":{"$error":"#N/A"}},{"$error":"#N/A"},{"$error":"#N/A"},{"$f":"IF(OR(A62<$B$38,A62=\"\",Inputs!J32=\"No\",Method_Cetin=FALSE),NA(),$E$36*0.65*G62/H62*I62)","v":{"$error":"#N/A"}},{"$error":"#N/A"}]

{"sheet":"PB Settlement","index":6,"n_rows":55,"n_cols":35,"rows_kept":55,"cut":false,"hidden":false,"merged":[[5,23,5,24],[33,23,33,24],[5,25,5,29],[33,25,33,29],[5,30,5,34],[33,30,33,34],[5,3,5,11],[5,12,5,20],[5,21,5,22],[33,3,33,7],[33,12,33,16],[33,21,33,22]]}
["Simplified Performance-based Settlement using Ishihara & Yoshimine (1992)"]
[]
["Depth to Water:",{"$f":"IF(design_gw=\"\",NA(),IF(units=2,CONVERT(design_gw,\"ft\",\"m\"),design_gw))","v":0},"m"]
["εv,IYref (%):",{"$f":"IF(Inputs!C53=\"\",NA(),Inputs!C53)","v":2.2999999999999998}]
["CSRref (%):",{"$f":"IF(CSR_ref_BI=\"\",NA(),CSR_ref_BI)","v":35.14}]
[null,null,null,"Compute Approximate Site Strain",null,null,null,null,null,null,null,null,"Compute Approximate Reference Strain",null,null,null,null,null,null,null,null,"Compute Corrrection Factor and Site Strain",null,"Calibrated Strain",null,"Compute Ground Surface Settlment",null,null,null,null,"Compute Settlement for Each Layer"]
["Depth (m)","Thickness (m)","Susceptible?","(N1)60,Cssite","CRR(Nsite)","CSRsite","FSLsite","Fαsite","γLIMsite","γMAXsite","εv,approx.site","PLIQsite","(N1)60,Csref","CSRref","CRRref","FSLref","Fαref","γLIMref","γMAXref","εv,approx.ref","PLIQref","Δε","εvsite","εv,calibratedsite","εv,calibratedsite (%)","DFi","ε*t*DFi","t*DFi","εv,eqv.site","Ssite (m)","εi*Dfi*Σti","Σ(ti*DFi)","εisite","Si (cm)","Ssite (cm)"]
[{"$f":"IF(Inputs!B13=\"\",\"\",IF(units=2,CONVERT(Inputs!B13,\"ft\",\"m\"),Inputs!B13))","v":0.4572},{"$f":"IF(Inputs!G13=\"\",\"\",IF(units=2,CONVERT(Inputs!G13,\"ft\",\"m\"),Inputs!G13))","v":0.91439999999999999},{"$f":"IF(A8=\"\",\"\",IF(OR(A8<$B$3,Inputs!J13=\"No\"),\"Not_susc.\",\"Susceptible\"))","v":"Susceptible"},{"$f":"IF(OR(A8=\"\",Method_BI=FALSE),NA(),'PB Liquefaction Initiation'!F10)","v":33.874185446686866},{"$f":"IF(OR(A8=\"\",Method_BI=FALSE),NA(),'PB Liquefaction Initiation'!Q10)","v":1.010930585237902},{"$f":"IF('PB Liquefaction Initiation'!P10=\"\",NA(),'PB Liquefaction Initiation'!P10)","v":0.22311236023806372},{"$f":"E8/F8","v":4.531038012233954},{"$f":"0.032+(0.69*SQRT(D8))-(0.13*D8)","v":-0.3557382711294359},{"$f":"MAX(0,1.859*(1.1-SQRT(D8/46))^3)","v":2.6302652334095056E-2},{"$f":"IF(G8<H8,I8,IF(G8<2,MIN(I8,0.035*(2-G8)*((1-H8)/(G8-H8))),0))","v":0},{"$f":"MAX(0,1.5*EXP(-0.369*SQRT(D8))*MIN(0.08,J8))*L8","v":0},{"$f":"_xlfn.NORM.S.DIST(LN(G8^-3.61),TRUE)","v":2.4550815476353654E-8},{"$f":"IF(A8=\"\",NA(),18)","v":18},{"$f":"IF(A8=\"\",NA(),$B$5/100)","v":0.35139999999999999},{"$f":"EXP((M8/14.1)+((M8/126)^2)-((M8/23.6)^3)+((M8/25.4)^4)-2.67)","v":0.20919631756361817},{"$f":"O8/N8","v":0.59532247456920373},{"$f":"IF(A8=\"\",NA(),0.6194)","v":0.61939999999999995},{"$f":"MAX(0,1.859*(1.1-SQRT(M8/46))^3)","v":0.19854972970494197},{"$f":"IF(P8<Q8,R8,IF(P8<2,MIN(R8,0.035*(2-P8)*((1-Q8)/(P8-Q8))),0))","v":0.19854972970494197},{"$f":"MAX(0,1.5*EXP(-0.369*SQRT(M8))*MIN(0.08,S8))*U8","v":2.4310291649609277E-2},{"$f":"_xlfn.NORM.S.DIST(LN(P8^-3.61),TRUE)","v":0.96941978730039002},{"$f":"LN(K8+0.01)/LN(T8+0.01)","v":1.3655833220798441},{"$f":"MAX(0,EXP(V8*LN($B$4/100+0.01))-0.01)","v":0},{"$f":"(142.92*(W8^3))+(16.3285*(W8^2))+(0.6802*W8)","v":0},{"$f":"X8*100","v":0},{"$f":"IF(A8=\"\",NA(),MAX(0,1-(A8/18)))","v":0.97460000000000002},{"$f":"X8*B8*Z8","v":0},{"$f":"IF(OR(A8=\"\",C8=\"Not_susc.\"),NA(),B8*Z8)","v":0.89117424000000001},{"$f":"SUMIFS(AA8:AA27,C8:C27,\"=Susceptible\",A8:A27,\"<18\")/SUMIFS(AB8:AB27,C8:C27,\"=Susceptible\",A8:A27,\"<18\")","v":3.2067190645915802E-2},{"$f":"0.9*AC8*SUMIFS(B8:B27,C8:C27,\"=Susceptible\",A8:A27,\"<18\")","v":0.41344357168541834},{"$f":"X8*Z8*SUMIFS($B$8:$B$27,$C$8:$C$27,\"=Susceptible\",$A$8:$A$27,\"<18\")","v":0},{"$f":"SUMIF(C8:C27,\"=Susceptible\",AB8:$AB$27)","v":7.3681945600000001},{"$f":"AE8/$AF$8","v":0},{"$f":"0.9*AG8*B8*100","v":0},{"$f":"SUMIF(C8:C27,\"=Susceptible\",(AH8:AH27))","v":41.344357168541833}]
[{"$f":"IF(Inputs!B14=\"\",\"\",IF(units=2,CONVERT(Inputs!B14,\"ft\",\"m\"),Inputs!B14))","v":1.6763999999999999},{"$f":"IF(Inputs!G14=\"\",\"\",IF(units=2,CONVERT(Inputs!G14,\"ft\",\"m\"),Inputs!G14))","v":1.524},{"$f":"IF(A9=\"\",\"\",IF(OR(A9<$B$3,Inputs!J14=\"No\"),\"Not_susc.\",\"Susceptible\"))","v":"Susceptible"},{"$f":"IF(OR(A9=\"\",Method_BI=FALSE),NA(),'PB Liquefaction Initiation'!F11)","v":11.900438780020192},{"$f":"IF(OR(A9=\"\",Method_BI=FALSE),NA(),'PB Liquefaction Initiation'!Q11)","v":0.15000143450236353},{"$f":"IF('PB Liquefaction Initiation'!P11=\"\",NA(),'PB Liquefaction Initiation'!P11)","v":0.40952183783721907},{"$f":"E9/F9","v":0.36628433612858424},{"$f":"0.032+(0.69*SQRT(D9))-(0.13*D9)","v":0.86523682767480725},{"$f":"MAX(0,1.859*(1.1-SQRT(D9/46))^3)","v":0.38446402727397266},{"$f":"IF(G9<H9,I9,IF(G9<2,MIN(I9,0.035*(2-G9)*((1-H9)/(G9-H9))),0))","v":0.38446402727397266},{"$f":"MAX(0,1.5*EXP(-0.369*SQRT(D9))*MIN(0.08,J9))*L9","v":3.359602882958794E-2},{"$f":"_xlfn.NORM.S.DIST(LN(G9^-3.61),TRUE)","v":0.9998559027570767},{"$f":"IF(A9=\"\",NA(),18)","v":18},0.35139999999999999,{"$f":"EXP((M9/14.1)+((M9/126)^2)-((M9/23.6)^3)+((M9/25.4)^4)-2.67)","v":0.20919631756361817},{"$f":"O9/N9","v":0.59532247456920373},{"$f":"IF(A9=\"\",NA(),0.6194)","v":0.61939999999999995},{"$f":"MAX(0,1.859*(1.1-SQRT(M9/46))^3)","v":0.19854972970494197},{"$f":"IF(P9<Q9,R9,IF(P9<2,MIN(R9,0.035*(2-P9)*((1-Q9)/(P9-Q9))),0))","v":0.19854972970494197},{"$f":"MAX(0,1.5*EXP(-0.369*SQRT(M9))*MIN(0.08,S9))*U9","v":2.4310291649609277E-2},{"$f":"_xlfn.NORM.S.DIST(LN(P9^-3.61),TRUE)","v":0.96941978730039002},{"$f":"LN(K9+0.01)/LN(T9+0.01)","v":0.92897428984396224},3.204724441512128E-2,4.3272303515712679E-2,{"$f":"X9*100","v":4.3272303515712682},{"$f":"IF(A9=\"\",NA(),MAX(0,1-(A9/18)))","v":0.90686666666666671},{"$f":"X9*B9*Z9","v":5.9805127503982737E-2},{"$f":"IF(OR(A9=\"\",C9=\"Not_susc.\"),NA(),B9*Z9)","v":1.3820648},null,null,{"$f":"X9*Z9*SUMIFS($B$8:$B$27,$C$8:$C$27,\"=Susceptible\",$A$8:$A$27,\"<18\")","v":0.56216819853743794},null,{"$f":"AE9/$AF$8","v":7.6296600742507797E-2},{"$f":"0.9*AG9*B9*100","v":10.464841757842368},{"$f":"IF(OR(C9=\"\",C9=\"Not_susc.\"),AI10,AI10+AH9)","v":41.344357168541833}]
[{"$f":"IF(Inputs!B15=\"\",\"\",IF(units=2,CONVERT(Inputs!B15,\"ft\",\"m\"),Inputs!B15))","v":3.2004000000000001},{"$f":"IF(Inputs!G15=\"\",\"\",IF(units=2,CONVERT(Inputs!G15,\"ft\",\"m\"),Inputs!G15))","v":1.524},{"$f":"IF(A10=\"\",\"\",IF(OR(A10<$B$3,Inputs!J15=\"No\"),\"Not_susc.\",\"Susceptible\"))","v":"Susceptible"},{"$f":"IF(OR(A10=\"\",Method_BI=FALSE),NA(),'PB Liquefaction Initiation'!F12)","v":13.693403668256009},{"$f":"IF(OR(A10=\"\",Method_BI=FALSE),NA(),'PB Liquefaction Initiation'!Q12)","v":0.165646826340756},{"$f":"IF('PB Liquefaction Initiation'!P12=\"\",NA(),'PB Liquefaction Initiation'!P12)","v":0.4161886272075469},0.39800901685415463,0.80517487246986019,0.31676842571943614,0.31676842571943614,3.0617787878679272E-2,0.99955921059563024,18,0.35139999999999999,0.20919631756361817,0.59532247456920373,0.61939999999999995,0.19854972970494197,0.19854972970494197,2.4310291649609277E-2,0.96941978730039002,0.94995693088512922,2.9142814454827491E-2,3.72282237448976E-2,3.7228223744897599,0.82220000000000004,{"$f":"X10*B10*Z10","v":4.6648185438095527E-2},1.2530328000000002,null,null,0.438492943118098,null,5.9511585850156756E-2,8.162609115207502,{"$f":"IF(OR(C10=\"\",C10=\"Not_susc.\"),AI11,AI11+AH10)","v":30.879515410699462}]
[{"$f":"IF(Inputs!B16=\"\",\"\",IF(units=2,CONVERT(Inputs!B16,\"ft\",\"m\"),Inputs!B16))","v":4.5720000000000001},{"$f":"IF(Inputs!G16=\"\",\"\",IF(units=2,CONVERT(Inputs!G16,\"ft\",\"m\"),Inputs!G16))","v":1.2192000000000001},{"$f":"IF(A11=\"\",\"\",IF(OR(A11<$B$3,Inputs!J16=\"No\"),\"Not_susc.\",\"Susceptible\"))","v":"Not_susc."},{"$f":"IF(OR(A11=\"\",Method_BI=FALSE),NA(),'PB Liquefaction Initiation'!F13)","v":7.5891695726420965},{"$f":"IF(OR(A11=\"\",Method_BI=FALSE),NA(),'PB Liquefaction Initiation'!Q13)","v":0.11608672878067261},{"$f":"IF('PB Liquefaction Initiation'!P13=\"\",NA(),'PB Liquefaction Initiation'!P13)","v":{"$error":"#N/A"}},{"$error":"#N/A"},0.9462508300558643,0.62089819936744439,{"$error":"#N/A"},{"$error":"#N/A"},{"$error":"#N/A"},18,0.35139999999999999,0.20919631756361817,0.59532247456920373,0.61939999999999995,0.19854972970494197,0.19854972970494197,2.4310291649609277E-2,0.96941978730039002,{"$error":"#N/A"},{"$error":"#N/A"},{"$error":"#N/A"},{"$error":"#N/A"},0.746,{"$error":"#N/A"},{"$error":"#N/A"},null,null,{"$error":"#N/A"},null,{"$error":"#N/A"},{"$error":"#N/A"},22.71690629549196]
[{"$f":"IF(Inputs!B17=\"\",\"\",IF(units=2,CONVERT(Inputs!B17,\"ft\",\"m\"),Inputs!B17))","v":6.2484000000000002},{"$f":"IF(Inputs!G17=\"\",\"\",IF(units=2,CONVERT(Inputs!G17,\"ft\",\"m\"),Inputs!G17))","v":2.1335999999999999},{"$f":"IF(A12=\"\",\"\",IF(OR(A12<$B$3,Inputs!J17=\"No\"),\"Not_susc.\",\"Susceptible\"))","v":"Susceptible"},{"$f":"IF(OR(A12=\"\",Method_BI=FALSE),NA(),'PB Liquefaction Initiation'!F14)","v":21.708473911296679},{"$f":"IF(OR(A12=\"\",Method_BI=FALSE),NA(),'PB Liquefaction Initiation'!Q14)","v":0.26042037964772907},{"$f":"IF('PB Liquefaction Initiation'!P14=\"\",NA(),'PB Liquefaction Initiation'!P14)","v":0.38666916463062412},0.67349663088987843,0.4247707730060597,0.13098886049804351,0.1073733265767137,1.9852400705456984E-2,0.92320038903243351,18,0.35139999999999999,0.20919631756361817,0.59532247456920373,0.61939999999999995,0.19854972970494197,0.19854972970494197,2.4310291649609277E-2,0.96941978730039002,1.0412714424956726,1.8666249279287318E-2,1.9315635106280735E-2,1.9315635106280735,0.65286666666666671,2.6905835996107623E-2,1.3929563200000001,null,null,0.18065347025957976,null,2.4518010319692175E-2,4.7080464136285709,22.71690629549196]
[{"$f":"IF(Inputs!B18=\"\",\"\",IF(units=2,CONVERT(Inputs!B18,\"ft\",\"m\"),Inputs!B18))","v":7.7724000000000002},{"$f":"IF(Inputs!G18=\"\",\"\",IF(units=2,CONVERT(Inputs!G18,\"ft\",\"m\"),Inputs!G18))","v":0.91439999999999999},{"$f":"IF(A13=\"\",\"\",IF(OR(A13<$B$3,Inputs!J18=\"No\"),\"Not_susc.\",\"Susceptible\"))","v":"Susceptible"},{"$f":"IF(OR(A13=\"\",Method_BI=FALSE),NA(),'PB Liquefaction Initiation'!F15)","v":29.14039966028972},{"$f":"IF(OR(A13=\"\",Method_BI=FALSE),NA(),'PB Liquefaction Initiation'!Q15)","v":0.49659069667537709},{"$f":"IF('PB Liquefaction Initiation'!P15=\"\",NA(),'PB Liquefaction Initiation'!P15)","v":0.34978821385211095},1.4196896207753118,-3.1504410263074156E-2,5.2269401579537765E-2,1.4436901333737245E-2,3.0407778248857652E-4,0.10292093908759756,18,0.35139999999999999,0.20919631756361817,0.59532247456920373,0.61939999999999995,0.19854972970494197,0.19854972970494197,2.4310291649609277E-2,0.96941978730039002,1.3567007976971137,0,0,0,0.56820000000000004,0,0.51956208000000004,null,null,0,null,0,0,18.00885988186339]
[{"$f":"IF(Inputs!B19=\"\",\"\",IF(units=2,CONVERT(Inputs!B19,\"ft\",\"m\"),Inputs!B19))","v":9.2964000000000002},{"$f":"IF(Inputs!G19=\"\",\"\",IF(units=2,CONVERT(Inputs!G19,\"ft\",\"m\"),Inputs!G19))","v":2.1335999999999999},{"$f":"IF(A14=\"\",\"\",IF(OR(A14<$B$3,Inputs!J19=\"No\"),\"Not_susc.\",\"Susceptible\"))","v":"Susceptible"},{"$f":"IF(OR(A14=\"\",Method_BI=FALSE),NA(),'PB Liquefaction Initiation'!F16)","v":21.337630575889257},{"$f":"IF(OR(A14=\"\",Method_BI=FALSE),NA(),'PB Liquefaction Initiation'!Q16)","v":0.25433828936835712},{"$f":"IF('PB Liquefaction Initiation'!P16=\"\",NA(),'PB Liquefaction Initiation'!P16)","v":0.38434246369067387},0.66174912583443657,0.44540247610388173,0.13667589506107522,0.12006967416917939,2.0338256521461238E-2,0.93194784011250043,18,0.35139999999999999,0.20919631756361817,0.59532247456920373,0.61939999999999995,0.19854972970494197,0.19854972970494197,2.4310291649609277E-2,0.96941978730039002,1.0364841466328927,1.9138231219913593E-2,2.0000335573725637E-2,2.0000335573725638,0.48353333333333337,2.0633680600244848E-2,1.03166672,null,null,0.13854042688735829,null,1.8802493033973074E-2,3.6105299223556453,18.00885988186339]
[{"$f":"IF(Inputs!B20=\"\",\"\",IF(units=2,CONVERT(Inputs!B20,\"ft\",\"m\"),Inputs!B20))","v":10.820399999999999},{"$f":"IF(Inputs!G20=\"\",\"\",IF(units=2,CONVERT(Inputs!G20,\"ft\",\"m\"),Inputs!G20))","v":0.91439999999999999},{"$f":"IF(A15=\"\",\"\",IF(OR(A15<$B$3,Inputs!J20=\"No\"),\"Not_susc.\",\"Susceptible\"))","v":"Susceptible"},{"$f":"IF(OR(A15=\"\",Method_BI=FALSE),NA(),'PB Liquefaction Initiation'!F17)","v":9.4876390112066709},{"$f":"IF(OR(A15=\"\",Method_BI=FALSE),NA(),'PB Liquefaction Initiation'!Q17)","v":0.1304252794205025},{"$f":"IF('PB Liquefaction Initiation'!P17=\"\",NA(),'PB Liquefaction Initiation'!P17)","v":0.41343030456417246},0.31547101888912921,0.92394570935796927,0.50080955459082255,0.50080955459082255,3.8508613550739881E-2,0.99998441976639829,18,0.35139999999999999,0.20919631756361817,0.59532247456920373,0.61939999999999995,0.19854972970494197,0.19854972970494197,2.4310291649609277E-2,0.96941978730039002,0.89731192211359367,3.6843020998393025E-2,5.4372637405831661E-2,5.4372637405831661,0.3988666666666667,1.9830988405960578E-2,0.36472368000000005,null,null,0.31068548502671572,null,4.216575478521508E-2,3.4700729558040599,14.398329959507745]
[{"$f":"IF(Inputs!B21=\"\",\"\",IF(units=2,CONVERT(Inputs!B21,\"ft\",\"m\"),Inputs!B21))","v":12.4968},{"$f":"IF(Inputs!G21=\"\",\"\",IF(units=2,CONVERT(Inputs!G21,\"ft\",\"m\"),Inputs!G21))","v":2.4384000000000001},{"$f":"IF(A16=\"\",\"\",IF(OR(A16<$B$3,Inputs!J21=\"No\"),\"Not_susc.\",\"Susceptible\"))","v":"Not_susc."},{"$f":"IF(OR(A16=\"\",Method_BI=FALSE),NA(),'PB Liquefaction Initiation'!F18)","v":7.3030476983682764},{"$f":"IF(OR(A16=\"\",Method_BI=FALSE),NA(),'PB Liquefaction Initiation'!Q18)","v":0.11400729285551024},{"$f":"IF('PB Liquefaction Initiation'!P18=\"\",NA(),'PB Liquefaction Initiation'!P18)","v":{"$error":"#N/A"}},{"$error":"#N/A"},0.94727025978708057,0.64188382601693383,{"$error":"#N/A"},{"$error":"#N/A"},{"$error":"#N/A"},18,0.35139999999999999,0.20919631756361817,0.59532247456920373,0.61939999999999995,0.19854972970494197,0.19854972970494197,2.4310291649609277E-2,0.96941978730039002,{"$error":"#N/A"},{"$error":"#N/A"},{"$error":"#N/A"},{"$error":"#N/A"},0.3057333333333333,{"$error":"#N/A"},{"$error":"#N/A"},null,null,{"$error":"#N/A"},null,{"$error":"#N/A"},{"$error":"#N/A"},10.928257003703685]
[{"$f":"IF(Inputs!B22=\"\",\"\",IF(units=2,CONVERT(Inputs!B22,\"ft\",\"m\"),Inputs!B22))","v":13.715999999999999},{"$f":"IF(Inputs!G22=\"\",\"\",IF(units=2,CONVERT(Inputs!G22,\"ft\",\"m\"),Inputs!G22))","v":0.91439999999999999},{"$f":"IF(A17=\"\",\"\",IF(OR(A17<$B$3,Inputs!J22=\"No\"),\"Not_susc.\",\"Susceptible\"))","v":"Susceptible"},{"$f":"IF(OR(A17=\"\",Method_BI=FALSE),NA(),'PB Liquefaction Initiation'!F19)","v":1.6327566637818389},{"$f":"IF(OR(A17=\"\",Method_BI=FALSE),NA(),'PB Liquefaction Initiation'!Q19)","v":7.774291842473656E-2},{"$f":"IF('PB Liquefaction Initiation'!P19=\"\",NA(),'PB Liquefaction Initiation'!P19)","v":0.3993356758905604},0.19468062364165611,0.70141926619459649,1.4082889447337894,1.4082889447337894,7.4887416822837616E-2,0.99999999826210184,18,0.35139999999999999,0.20919631756361817,0.59532247456920373,0.61939999999999995,0.19854972970494197,0.19854972970494197,2.4310291649609277E-2,0.96941978730039002,0.73137685018431342,7.2504073522097812E-2,0.18962646032333808,18.962646032333808,0.23799999999999999,4.1267875606079162E-2,0.21762719999999999,null,null,0.64653005116190687,null,8.7746061249759782E-2,7.2211498566102321,10.928257003703685]
[{"$f":"IF(Inputs!B23=\"\",\"\",IF(units=2,CONVERT(Inputs!B23,\"ft\",\"m\"),Inputs!B23))","v":15.6972},{"$f":"IF(Inputs!G23=\"\",\"\",IF(units=2,CONVERT(Inputs!G23,\"ft\",\"m\"),Inputs!G23))","v":2.1335999999999999},{"$f":"IF(A18=\"\",\"\",IF(OR(A18<$B$3,Inputs!J23=\"No\"),\"Not_susc.\",\"Susceptible\"))","v":"Susceptible"},{"$f":"IF(OR(A18=\"\",Method_BI=FALSE),NA(),'PB Liquefaction Initiation'!F20)","v":9.6599215676559655},{"$f":"IF(OR(A18=\"\",Method_BI=FALSE),NA(),'PB Liquefaction Initiation'!Q20)","v":0.13177233281099929},{"$f":"IF('PB Liquefaction Initiation'!P20=\"\",NA(),'PB Liquefaction Initiation'!P20)","v":0.37845267566951402},0.34818708198556969,0.92075878701841929,0.49132111759457353,0.49132111759457353,3.811296732975665E-2,0.99993012361851308,18,0.35139999999999999,0.20919631756361817,0.59532247456920373,0.61939999999999995,0.19854972970494197,0.19854972970494197,2.4310291649609277E-2,0.96941978730039002,0.8997404205361057,3.645656653446832E-2,5.3424667987769361E-2,5.3424667987769361,0.12793333333333334,1.4582720442419622E-2,0.27295856000000002,null,null,9.7912551541960338E-2,null,1.3288540461933776E-2,2.5517186936623708,3.7071071470934518]
[{"$f":"IF(Inputs!B24=\"\",\"\",IF(units=2,CONVERT(Inputs!B24,\"ft\",\"m\"),Inputs!B24))","v":17.3736},{"$f":"IF(Inputs!G24=\"\",\"\",IF(units=2,CONVERT(Inputs!G24,\"ft\",\"m\"),Inputs!G24))","v":1.2192000000000001},{"$f":"IF(A19=\"\",\"\",IF(OR(A19<$B$3,Inputs!J24=\"No\"),\"Not_susc.\",\"Susceptible\"))","v":"Susceptible"},{"$f":"IF(OR(A19=\"\",Method_BI=FALSE),NA(),'PB Liquefaction Initiation'!F21)","v":2.3758590121854533},{"$f":"IF(OR(A19=\"\",Method_BI=FALSE),NA(),'PB Liquefaction Initiation'!Q21)","v":8.1913820303973858E-2},{"$f":"IF('PB Liquefaction Initiation'!P21=\"\",NA(),'PB Liquefaction Initiation'!P21)","v":0.36959317274726489},0.22163239568277454,0.7866920297876151,1.2357410117235026,1.2357410117235026,6.7946572181170756E-2,0.99999997325692302,18,0.35139999999999999,0.20919631756361817,0.59532247456920373,0.61939999999999995,0.19854972970494197,0.19854972970494197,2.4310291649609277E-2,0.96941978730039002,0.75667175267398812,6.5683524122823994E-2,0.15562507727956096,15.562507727956095,3.4800000000000053E-2,6.6028856788295873E-3,4.2428160000000069E-2,null,null,7.7583906726247653E-2,null,1.0529568145150561E-2,1.155388453431081,1.155388453431081]
[{"$f":"IF(Inputs!B25=\"\",\"\",IF(units=2,CONVERT(Inputs!B25,\"ft\",\"m\"),Inputs!B25))","v":""},{"$f":"IF(Inputs!G25=\"\",\"\",IF(units=2,CONVERT(Inputs!G25,\"ft\",\"m\"),Inputs!G25))","v":""},{"$f":"IF(A20=\"\",\"\",IF(OR(A20<$B$3,Inputs!J25=\"No\"),\"Not_susc.\",\"Susceptible\"))","v":""},{"$f":"IF(OR(A20=\"\",Method_BI=FALSE),NA(),'PB Liquefaction Initiation'!F22)","v":{"$error":"#N/A"}},{"$f":"IF(OR(A20=\"\",Method_BI=FALSE),NA(),'PB Liquefaction Initiation'!Q22)","v":{"$error":"#N/A"}},{"$f":"IF('PB Liquefaction Initiation'!P22=\"\",NA(),'PB Liquefaction Initiation'!P22)","v":{"$error":"#N/A"}},{"$error":"#N/A"},{"$error":"#N/A"},{"$error":"#N/A"},{"$error":"#N/A"},{"$error":"#N/A"},{"$error":"#N/A"},{"$error":"#N/A"},{"$error":"#N/A"},{"$error":"#N/A"},{"$error":"#N/A"},{"$error":"#N/A"},{"$error":"#N/A"},{"$error":"#N/A"},{"$error":"#N/A"},{"$error":"#N/A"},{"$error":"#N/A"},{"$error":"#N/A"},{"$error":"#N/A"},{"$error":"#N/A"},{"$error":"#N/A"},{"$error":"#N/A"},{"$error":"#N/A"},null,null,{"$error":"#N/A"},null,{"$error":"#N/A"},{"$error":"#N/A"},0]
[{"$f":"IF(Inputs!B26=\"\",\"\",IF(units=2,CONVERT(Inputs!B26,\"ft\",\"m\"),Inputs!B26))","v":""},{"$f":"IF(Inputs!G26=\"\",\"\",IF(units=2,CONVERT(Inputs!G26,\"ft\",\"m\"),Inputs!G26))","v":""},{"$f":"IF(A21=\"\",\"\",IF(OR(A21<$B$3,Inputs!J26=\"No\"),\"Not_susc.\",\"Susceptible\"))","v":""},{"$f":"IF(OR(A21=\"\",Method_BI=FALSE),NA(),'PB Liquefaction Initiation'!F23)","v":{"$error":"#N/A"}},{"$f":"IF(OR(A21=\"\",Method_BI=FALSE),NA(),'PB Liquefaction Initiation'!Q23)","v":{"$error":"#N/A"}},{"$f":"IF('PB Liquefaction Initiation'!P23=\"\",NA(),'PB Liquefaction Initiation'!P23)","v":{"$error":"#N/A"}},{"$error":"#N/A"},{"$error":"#N/A"},{"$error":"#N/A"},{"$error":"#N/A"},{"$error":"#N/A"},{"$error":"#N/A"},{"$error":"#N/A"},{"$error":"#N/A"},{"$error":"#N/A"},{"$error":"#N/A"},{"$error":"#N/A"},{"$error":"#N/A"},{"$error":"#N/A"},{"$error":"#N/A"},{"$error":"#N/A"},{"$error":"#N/A"},{"$error":"#N/A"},{"$error":"#N/A"},{"$error":"#N/A"},{"$error":"#N/A"},{"$error":"#N/A"},{"$error":"#N/A"},null,null,{"$error":"#N/A"},null,{"$error":"#N/A"},{"$error":"#N/A"},{"$f":"IF(OR(C21=\"\",C21=\"Not_susc.\"),AI22,AI22+AH21)","v":0}]
[{"$f":"IF(Inputs!B27=\"\",\"\",IF(units=2,CONVERT(Inputs!B27,\"ft\",\"m\"),Inputs!B27))","v":""},{"$f":"IF(Inputs!G27=\"\",\"\",IF(units=2,CONVERT(Inputs!G27,\"ft\",\"m\"),Inputs!G27))","v":""},{"$f":"IF(A22=\"\",\"\",IF(OR(A22<$B$3,Inputs!J27=\"No\"),\"Not_susc.\",\"Susceptible\"))","v":""},{"$f":"IF(OR(A22=\"\",Method_BI=FALSE),NA(),'PB Liquefaction Initiation'!F24)","v":{"$error":"#N/A"}},{"$f":"IF(OR(A22=\"\",Method_BI=FALSE),NA(),'PB Liquefaction Initiation'!Q24)","v":{"$error":"#N/A"}},{"$f":"IF('PB Liquefaction Initiation'!P24=\"\",NA(),'PB Liquefaction Initiation'!P24)","v":{"$error":"#N/A"}},{"$error":"#N/A"},{"$error":"#N/A"},{"$error":"#N/A"},{"$error":"#N/A"},{"$error":"#N/A"},{"$error":"#N/A"},{"$error":"#N/A"},{"$error":"#N/A"},{"$error":"#N/A"},{"$error":"#N/A"},{"$error":"#N/A"},{"$error":"#N/A"},{"$error":"#N/A"},{"$error":"#N/A"},{"$error":"#N/A"},{"$error":"#N/A"},{"$error":"#N/A"},{"$error":"#N/A"},{"$error":"#N/A"},{"$error":"#N/A"},{"$error":"#N/A"},{"$error":"#N/A"},null,null,{"$error":"#N/A"},null,{"$error":"#N/A"},{"$error":"#N/A"},0]
[{"$f":"IF(Inputs!B28=\"\",\"\",IF(units=2,CONVERT(Inputs!B28,\"ft\",\"m\"),Inputs!B28))","v":""},{"$f":"IF(Inputs!G28=\"\",\"\",IF(units=2,CONVERT(Inputs!G28,\"ft\",\"m\"),Inputs!G28))","v":""},{"$f":"IF(A23=\"\",\"\",IF(OR(A23<$B$3,Inputs!J28=\"No\"),\"Not_susc.\",\"Susceptible\"))","v":""},{"$f":"IF(OR(A23=\"\",Method_BI=FALSE),NA(),'PB Liquefaction Initiation'!F25)","v":{"$error":"#N/A"}},{"$f":"IF(OR(A23=\"\",Method_BI=FALSE),NA(),'PB Liquefaction Initiation'!Q25)","v":{"$error":"#N/A"}},{"$f":"IF('PB Liquefaction Initiation'!P25=\"\",NA(),'PB Liquefaction Initiation'!P25)","v":{"$error":"#N/A"}},{"$error":"#N/A"},{"$error":"#N/A"},{"$error":"#N/A"},{"$error":"#N/A"},{"$error":"#N/A"},{"$error":"#N/A"},{"$error":"#N/A"},{"$error":"#N/A"},{"$error":"#N/A"},{"$error":"#N/A"},{"$error":"#N/A"},{"$error":"#N/A"},{"$error":"#N/A"},{"$error":"#N/A"},{"$error":"#N/A"},{"$error":"#N/A"},{"$error":"#N/A"},{"$error":"#N/A"},{"$error":"#N/A"},{"$error":"#N/A"},{"$error":"#N/A"},{"$error":"#N/A"},null,null,{"$error":"#N/A"},null,{"$error":"#N/A"},{"$error":"#N/A"},{"$f":"IF(OR(C23=\"\",C23=\"Not_susc.\"),AI24,AI24+AH23)","v":0}]
[{"$f":"IF(Inputs!B29=\"\",\"\",IF(units=2,CONVERT(Inputs!B29,\"ft\",\"m\"),Inputs!B29))","v":""},{"$f":"IF(Inputs!G29=\"\",\"\",IF(units=2,CONVERT(Inputs!G29,\"ft\",\"m\"),Inputs!G29))","v":""},{"$f":"IF(A24=\"\",\"\",IF(OR(A24<$B$3,Inputs!J29=\"No\"),\"Not_susc.\",\"Susceptible\"))","v":""},{"$f":"IF(OR(A24=\"\",Method_BI=FALSE),NA(),'PB Liquefaction Initiation'!F26)","v":{"$error":"#N/A"}},{"$f":"IF(OR(A24=\"\",Method_BI=FALSE),NA(),'PB Liquefaction Initiation'!Q26)","v":{"$error":"#N/A"}},{"$f":"IF('PB Liquefaction Initiation'!P26=\"\",NA(),'PB Liquefaction Initiation'!P26)","v":{"$error":"#N/A"}},{"$error":"#N/A"},{"$error":"#N/A"},{"$error":"#N/A"},{"$error":"#N/A"},{"$error":"#N/A"},{"$error":"#N/A"},{"$error":"#N/A"},{"$error":"#N/A"},{"$error":"#N/A"},{"$error":"#N/A"},{"$error":"#N/A"},{"$error":"#N/A"},{"$error":"#N/A"},{"$error":"#N/A"},{"$error":"#N/A"},{"$error":"#N/A"},{"$error":"#N/A"},{"$error":"#N/A"},{"$error":"#N/A"},{"$error":"#N/A"},{"$error":"#N/A"},{"$error":"#N/A"},null,null,{"$error":"#N/A"},null,{"$error":"#N/A"},{"$error":"#N/A"},0]
[{"$f":"IF(Inputs!B30=\"\",\"\",IF(units=2,CONVERT(Inputs!B30,\"ft\",\"m\"),Inputs!B30))","v":""},{"$f":"IF(Inputs!G30=\"\",\"\",IF(units=2,CONVERT(Inputs!G30,\"ft\",\"m\"),Inputs!G30))","v":""},{"$f":"IF(A25=\"\",\"\",IF(OR(A25<$B$3,Inputs!J30=\"No\"),\"Not_susc.\",\"Susceptible\"))","v":""},{"$f":"IF(OR(A25=\"\",Method_BI=FALSE),NA(),'PB Liquefaction Initiation'!F27)","v":{"$error":"#N/A"}},{"$f":"IF(OR(A25=\"\",Method_BI=FALSE),NA(),'PB Liquefaction Initiation'!Q27)","v":{"$error":"#N/A"}},{"$f":"IF('PB Liquefaction Initiation'!P27=\"\",NA(),'PB Liquefaction Initiation'!P27)","v":{"$error":"#N/A"}},{"$error":"#N/A"},{"$error":"#N/A"},{"$error":"#N/A"},{"$error":"#N/A"},{"$error":"#N/A"},{"$error":"#N/A"},{"$error":"#N/A"},{"$error":"#N/A"},{"$error":"#N/A"},{"$error":"#N/A"},{"$error":"#N/A"},{"$error":"#N/A"},{"$error":"#N/A"},{"$error":"#N/A"},{"$error":"#N/A"},{"$error":"#N/A"},{"$error":"#N/A"},{"$error":"#N/A"},{"$error":"#N/A"},{"$error":"#N/A"},{"$error":"#N/A"},{"$error":"#N/A"},null,null,{"$error":"#N/A"},null,{"$error":"#N/A"},{"$error":"#N/A"},0]
[{"$f":"IF(Inputs!B31=\"\",\"\",IF(units=2,CONVERT(Inputs!B31,\"ft\",\"m\"),Inputs!B31))","v":""},{"$f":"IF(Inputs!G31=\"\",\"\",IF(units=2,CONVERT(Inputs!G31,\"ft\",\"m\"),Inputs!G31))","v":""},{"$f":"IF(A26=\"\",\"\",IF(OR(A26<$B$3,Inputs!J31=\"No\"),\"Not_susc.\",\"Susceptible\"))","v":""},{"$f":"IF(OR(A26=\"\",Method_BI=FALSE),NA(),'PB Liquefaction Initiation'!F28)","v":{"$error":"#N/A"}},{"$f":"IF(OR(A26=\"\",Method_BI=FALSE),NA(),'PB Liquefaction Initiation'!Q28)","v":{"$error":"#N/A"}},{"$f":"IF('PB Liquefaction Initiation'!P28=\"\",NA(),'PB Liquefaction Initiation'!P28)","v":{"$error":"#N/A"}},{"$error":"#N/A"},{"$error":"#N/A"},{"$error":"#N/A"},{"$error":"#N/A"},{"$error":"#N/A"},{"$error":"#N/A"},{"$error":"#N/A"},{"$error":"#N/A"},{"$error":"#N/A"},{"$error":"#N/A"},{"$error":"#N/A"},{"$error":"#N/A"},{"$error":"#N/A"},{"$error":"#N/A"},{"$error":"#N/A"},{"$error":"#N/A"},{"$error":"#N/A"},{"$error":"#N/A"},{"$error":"#N/A"},{"$error":"#N/A"},{"$error":"#N/A"},{"$error":"#N/A"},null,null,{"$error":"#N/A"},null,{"$error":"#N/A"},{"$error":"#N/A"},{"$f":"IF(OR(C26=\"\",C26=\"Not_susc.\"),AI27,AI27+AH26)","v":0}]
[{"$f":"IF(Inputs!B32=\"\",\"\",IF(units=2,CONVERT(Inputs!B32,\"ft\",\"m\"),Inputs!B32))","v":""},{"$f":"IF(Inputs!G32=\"\",\"\",IF(units=2,CONVERT(Inputs!G32,\"ft\",\"m\"),Inputs!G32))","v":""},{"$f":"IF(A27=\"\",\"\",IF(OR(A27<$B$3,Inputs!J32=\"No\"),\"Not_susc.\",\"Susceptible\"))","v":""},{"$f":"IF(OR(A27=\"\",Method_BI=FALSE),NA(),'PB Liquefaction Initiation'!F29)","v":{"$error":"#N/A"}},{"$f":"IF(OR(A27=\"\",Method_BI=FALSE),NA(),'PB Liquefaction Initiation'!Q29)","v":{"$error":"#N/A"}},{"$f":"IF('PB Liquefaction Initiation'!P29=\"\",NA(),'PB Liquefaction Initiation'!P29)","v":{"$error":"#N/A"}},{"$error":"#N/A"},{"$error":"#N/A"},{"$error":"#N/A"},{"$error":"#N/A"},{"$error":"#N/A"},{"$error":"#N/A"},{"$error":"#N/A"},{"$error":"#N/A"},{"$error":"#N/A"},{"$error":"#N/A"},{"$error":"#N/A"},{"$error":"#N/A"},{"$error":"#N/A"},{"$error":"#N/A"},{"$error":"#N/A"},{"$error":"#N/A"},{"$error":"#N/A"},{"$error":"#N/A"},{"$error":"#N/A"},{"$error":"#N/A"},{"$error":"#N/A"},{"$error":"#N/A"},null,null,{"$error":"#N/A"},null,{"$error":"#N/A"},{"$error":"#N/A"},{"$f":"IF(OR(C27=\"\",C27=\"Not_susc.\"),0,AH27)","v":0}]
[]
[]
["Simplified Performance-based Settlement using Cetin et al. (2009)"]
[]
["εv,Cetinref (%):",{"$f":"IF(Inputs!C52=\"\",NA(),Inputs!C52)","v":2.2999999999999998}]
["Nreqref (%):",{"$f":"IF(Nreq_ref_Cet=\"\",NA(),Nreq_ref_Cet)","v":49.09}]
[null,null,null,"Compute Approximate Site Strain",null,null,null,null,null,null,null,null,"Compute Approximate Reference Strain",null,null,null,null,null,null,null,null,"Compute Corrrection Factor and Site Strain",null,"Calibrated Strain",null,"Compute Ground Surface Settlment",null,null,null,null,"Compute Settlement for Each Layer"]
["Depth (m)","Thickness (m)","Susceptible?","(N1)60,Cssite","CRR(Nreq)site","DR (%)site","PLIQsite","εv,approx.site",null,null,null,null,"(N1)60,Csref","CRR(Nreq)ref","DR (%)ref","PLIQref","εv,approx.ref",null,null,null,null,"Δε","εvsite","εv,calibratedsite ","εv,calibratedsite (%)","DFi","ε*t*DFi","t*DFi","εv,eqv.site","Ssite (m)","εi*Dfi*Σti","Σ(ti*DFi)","εisite","Si (cm)","Ssite (cm)"]
[{"$f":"IF(Inputs!B13=\"\",\"\",IF(units=2,CONVERT(Inputs!B13,\"ft\",\"m\"),Inputs!B13))","v":0.4572},{"$f":"IF(Inputs!G13=\"\",\"\",IF(units=2,CONVERT(Inputs!G13,\"ft\",\"m\"),Inputs!G13))","v":0.91439999999999999},{"$f":"C8","v":"Susceptible"},{"$f":"IF(A36=\"\",NA(),'PB Liquefaction Initiation'!D43)","v":32.632000000000005},{"$f":"EXP(('PB Liquefaction Initiation'!J43-(29.06*LN(7.5))+15.25)/13.79)","v":0.91015780813833913},{"$f":"SQRT(D36/60)*100","v":73.747316335353304},{"$f":"_xlfn.NORM.S.DIST(-(D36-'PB Liquefaction Initiation'!J43)/4.21,TRUE)","v":0.98700458844407801},{"$f":"MAX(0,((1.879*LN((780.416*LN(E36/(0.361*LN(F36)-0.579))-D36+2442.465)/(636.613*D36+306.732))+5.583)/100)*G36)","v":1.4473546260298261E-2},null,null,null,null,{"$f":"IF(A36=\"\",NA(),17.79)","v":17.79},{"$f":"IF(A36=\"\",NA(),EXP(($B$33-(29.06*LN(7.5))+15.25)/13.79))","v":1.5214228636759974},{"$f":"SQRT(M36/60)*100","v":54.451813560247928},{"$f":"_xlfn.NORM.S.DIST(-(M36-$B$33)/4.21,TRUE)","v":0.9999999999999476},{"$f":"MAX(0,((1.879*LN((780.416*LN(N36/(0.361*LN(O36)-0.579))-M36+2442.465)/(636.613*M36+306.732))+5.583)/100)*P36)","v":2.9509540888956992E-2},null,null,null,null,{"$f":"LN(H36+0.01)/LN(Q36+0.01)","v":1.1482258769260709},{"$f":"MAX(0,EXP(V36*LN($B$32/100+0.01))-0.01)","v":9.9030378752177611E-3},{"$f":"6.6896*W36^2+0.883*W36","v":9.4004325805206231E-3},{"$f":"X36*100","v":0.94004325805206235},{"$f":"IF(A36=\"\",NA(),MAX(0,1-(A36/18)))","v":0.97460000000000002},{"$f":"X36*B36*Z36","v":8.3774233606167051E-3},{"$f":"IF(OR(A36=\"\",C36=\"Not_susc.\"),NA(),B36*Z36)","v":0.89117424000000001},{"$f":"SUMIFS(AA36:AA55,C36:C55,\"=Susceptible\",A36:A55,\"<18\")/SUMIFS(AB36:AB55,C36:C55,\"=Susceptible\",A36:A55,\"<18\")","v":2.6112559416338159E-2},{"$f":"1.15*AC36*SUMIFS(B36:B55,C36:C55,\"=Susceptible\",A36:A55,\"<18\")","v":0.43018979335089802},{"$f":"X36*Z36*SUMIFS($B$36:$B$55,$C$36:$C$55,\"=Susceptible\",$A$36:$A$55,\"<18\")","v":0.13124629931632839},{"$f":"SUMIF(C36:C55,\"=Susceptible\",AB36:AB55)","v":7.3681945600000001},{"$f":"AE36/$AF$36","v":1.781254529146532E-2},{"$f":"1.15*AG36*B36*100","v":1.8730960126693268},{"$f":"SUMIF(C36:C55,\"=Susceptible\",AH36:AH55)","v":43.018979335089803}]
[{"$f":"IF(Inputs!B14=\"\",\"\",IF(units=2,CONVERT(Inputs!B14,\"ft\",\"m\"),Inputs!B14))","v":1.6763999999999999},{"$f":"IF(Inputs!G14=\"\",\"\",IF(units=2,CONVERT(Inputs!G14,\"ft\",\"m\"),Inputs!G14))","v":1.524},{"$f":"C9","v":"Susceptible"},{"$f":"IF(A37=\"\",NA(),'PB Liquefaction Initiation'!D44)","v":10.621491593382261},{"$f":"EXP(('PB Liquefaction Initiation'!J44-(29.06*LN(7.5))+15.25)/13.79)","v":1.2916476304166726},{"$f":"SQRT(D37/60)*100","v":42.074322322493131},{"$f":"_xlfn.NORM.S.DIST(-(D37-'PB Liquefaction Initiation'!J44)/4.21,TRUE)","v":1},{"$f":"MAX(0,((1.879*LN((780.416*LN(E37/(0.361*LN(F37)-0.579))-D37+2442.465)/(636.613*D37+306.732))+5.583)/100)*G37)","v":3.8660592460875234E-2},null,null,null,null,17.79,1.5214228636759974,{"$f":"SQRT(M37/60)*100","v":54.451813560247928},0.9999999999999476,{"$f":"MAX(0,((1.879*LN((780.416*LN(N37/(0.361*LN(O37)-0.579))-M37+2442.465)/(636.613*M37+306.732))+5.583)/100)*P37)","v":2.9509540888956992E-2},null,null,null,null,0.93552658940752564,3.1117850098797015E-2,{"$f":"6.6896*W37^2+0.883*W37","v":3.3954739088019194E-2},{"$f":"X37*100","v":3.3954739088019195},{"$f":"IF(A37=\"\",NA(),MAX(0,1-(A37/18)))","v":0.90686666666666671},{"$f":"X37*B37*Z37","v":4.6927649686735434E-2},{"$f":"IF(OR(A37=\"\",C37=\"Not_susc.\"),NA(),B37*Z37)","v":1.3820648},null,null,{"$f":"X37*Z37*SUMIFS($B$36:$B$55,$C$36:$C$55,\"=Susceptible\",$A$36:$A$55,\"<18\")","v":0.44111990705531312},null,{"$f":"AE37/$AF$36","v":5.9868113343537054E-2},{"$f":"1.15*AG37*B37*100","v":10.492485544588304},{"$f":"IF(OR(C37=\"\",C37=\"Not_susc.\"),AI38,AI38+AH37)","v":41.145883322420474}]
[{"$f":"IF(Inputs!B15=\"\",\"\",IF(units=2,CONVERT(Inputs!B15,\"ft\",\"m\"),Inputs!B15))","v":3.2004000000000001},{"$f":"IF(Inputs!G15=\"\",\"\",IF(units=2,CONVERT(Inputs!G15,\"ft\",\"m\"),Inputs!G15))","v":1.524},"Susceptible",{"$f":"IF(A38=\"\",NA(),'PB Liquefaction Initiation'!D45)","v":13.32533678800505},{"$f":"EXP(('PB Liquefaction Initiation'!J45-(29.06*LN(7.5))+15.25)/13.79)","v":1.5162249266750998},47.126313930409495,{"$f":"_xlfn.NORM.S.DIST(-(D38-'PB Liquefaction Initiation'!J45)/4.21,TRUE)","v":1},3.5101440956544855E-2,null,null,null,null,17.79,1.5214228636759974,{"$f":"SQRT(M38/60)*100","v":54.451813560247928},0.9999999999999476,{"$f":"MAX(0,((1.879*LN((780.416*LN(N38/(0.361*LN(O38)-0.579))-M38+2442.465)/(636.613*M38+306.732))+5.583)/100)*P38)","v":2.9509540888956992E-2},null,null,null,null,0.95903333882988773,2.7949449236998554E-2,2.9905089965223591E-2,2.990508996522359,0.82220000000000004,{"$f":"X38*B38*Z38","v":3.7472058613376019E-2},1.2530328000000002,null,null,0.35223735096573461,null,4.7805109935334635E-2,8.3783235672667473,30.653397777832168]
[{"$f":"IF(Inputs!B16=\"\",\"\",IF(units=2,CONVERT(Inputs!B16,\"ft\",\"m\"),Inputs!B16))","v":4.5720000000000001},{"$f":"IF(Inputs!G16=\"\",\"\",IF(units=2,CONVERT(Inputs!G16,\"ft\",\"m\"),Inputs!G16))","v":1.2192000000000001},"Not_susc.",{"$f":"IF(A39=\"\",NA(),'PB Liquefaction Initiation'!D46)","v":4.0320252341104634},{"$f":"EXP(('PB Liquefaction Initiation'!J46-(29.06*LN(7.5))+15.25)/13.79)","v":{"$error":"#N/A"}},25.92304391241656,{"$f":"_xlfn.NORM.S.DIST(-(D39-'PB Liquefaction Initiation'!J46)/4.21,TRUE)","v":{"$error":"#N/A"}},{"$error":"#N/A"},null,null,null,null,17.79,1.5214228636759974,54.451813560247928,0.9999999999999476,2.9509540888956992E-2,null,null,null,null,{"$error":"#N/A"},{"$error":"#N/A"},{"$error":"#N/A"},{"$error":"#N/A"},0.746,{"$error":"#N/A"},{"$error":"#N/A"},null,null,{"$error":"#N/A"},null,{"$error":"#N/A"},{"$error":"#N/A"},22.275074210565421]
[{"$f":"IF(Inputs!B17=\"\",\"\",IF(units=2,CONVERT(Inputs!B17,\"ft\",\"m\"),Inputs!B17))","v":6.2484000000000002},{"$f":"IF(Inputs!G17=\"\",\"\",IF(units=2,CONVERT(Inputs!G17,\"ft\",\"m\"),Inputs!G17))","v":2.1335999999999999},"Susceptible",{"$f":"IF(A40=\"\",NA(),'PB Liquefaction Initiation'!D47)","v":22.247219944730496},{"$f":"EXP(('PB Liquefaction Initiation'!J47-(29.06*LN(7.5))+15.25)/13.79)","v":1.6982787548457046},60.892281865507528,{"$f":"_xlfn.NORM.S.DIST(-(D40-'PB Liquefaction Initiation'!J47)/4.21,TRUE)","v":0.99999999999186895},2.5705478872901481E-2,null,null,null,null,17.79,1.5214228636759974,54.451813560247928,0.9999999999999476,2.9509540888956992E-2,null,null,null,null,1.0313312785090696,1.9654942584265138E-2,1.9939618953057101E-2,1.9939618953057101,0.65286666666666671,2.7775018239052676E-2,1.3929563200000001,null,null,0.18648940817649654,null,2.5310054811649347E-2,6.2101762888055294,22.275074210565421]
[{"$f":"IF(Inputs!B18=\"\",\"\",IF(units=2,CONVERT(Inputs!B18,\"ft\",\"m\"),Inputs!B18))","v":7.7724000000000002},{"$f":"IF(Inputs!G18=\"\",\"\",IF(units=2,CONVERT(Inputs!G18,\"ft\",\"m\"),Inputs!G18))","v":0.91439999999999999},"Susceptible",{"$f":"IF(A41=\"\",NA(),'PB Liquefaction Initiation'!D48)","v":30.426482551232123},{"$f":"EXP(('PB Liquefaction Initiation'!J48-(29.06*LN(7.5))+15.25)/13.79)","v":1.7010963640116012},71.211518908146829,{"$f":"_xlfn.NORM.S.DIST(-(D41-'PB Liquefaction Initiation'!J48)/4.21,TRUE)","v":0.99999920181503199},1.957680311570259E-2,null,null,null,null,17.79,1.5214228636759974,54.451813560247928,0.9999999999999476,2.9509540888956992E-2,null,null,null,null,1.0896108675512144,1.4308417610036631E-2,1.4003900006362995E-2,1.4003900006362995,0.56820000000000004,7.275895415417971E-3,0.51956208000000004,null,null,0.11398902817488156,null,1.5470415072058244E-2,1.6268069673173564,16.06489792175989]
[{"$f":"IF(Inputs!B19=\"\",\"\",IF(units=2,CONVERT(Inputs!B19,\"ft\",\"m\"),Inputs!B19))","v":9.2964000000000002},{"$f":"IF(Inputs!G19=\"\",\"\",IF(units=2,CONVERT(Inputs!G19,\"ft\",\"m\"),Inputs!G19))","v":2.1335999999999999},"Susceptible",{"$f":"IF(A42=\"\",NA(),'PB Liquefaction Initiation'!D49)","v":20.884133717749325},{"$f":"EXP(('PB Liquefaction Initiation'!J49-(29.06*LN(7.5))+15.25)/13.79)","v":1.6610634379294424},58.997363949232685,{"$f":"_xlfn.NORM.S.DIST(-(D42-'PB Liquefaction Initiation'!J49)/4.21,TRUE)","v":0.99999999999859945},2.6828668506534124E-2,null,null,null,null,17.79,1.5214228636759974,54.451813560247928,0.9999999999999476,2.9509540888956992E-2,null,null,null,null,1.0217458907181083,2.064063108376761E-2,2.1075685341483321E-2,2.1075685341483319,0.48353333333333337,2.174308316800018E-2,1.03166672,null,null,0.1459892726994298,null,1.9813438897497E-2,4.8615046216454534,14.438090954442533]
[{"$f":"IF(Inputs!B20=\"\",\"\",IF(units=2,CONVERT(Inputs!B20,\"ft\",\"m\"),Inputs!B20))","v":10.820399999999999},{"$f":"IF(Inputs!G20=\"\",\"\",IF(units=2,CONVERT(Inputs!G20,\"ft\",\"m\"),Inputs!G20))","v":0.91439999999999999},"Susceptible",{"$f":"IF(A43=\"\",NA(),'PB Liquefaction Initiation'!D50)","v":9.1514758932516074},{"$f":"EXP(('PB Liquefaction Initiation'!J50-(29.06*LN(7.5))+15.25)/13.79)","v":1.5966016704099157},39.054397731991735,{"$f":"_xlfn.NORM.S.DIST(-(D43-'PB Liquefaction Initiation'!J50)/4.21,TRUE)","v":1},4.2576670172793998E-2,null,null,null,null,17.79,1.5214228636759974,54.451813560247928,0.9999999999999476,2.9509540888956992E-2,null,null,null,null,0.91157181655756458,3.4618920717460533E-2,3.8585789708932755E-2,3.8585789708932756,0.3988666666666667,1.4073151218348083E-2,0.36472368000000005,null,null,0.22047936908745336,null,2.9923119875848305E-2,3.1465955936647041,9.5765863327970795]
[{"$f":"IF(Inputs!B21=\"\",\"\",IF(units=2,CONVERT(Inputs!B21,\"ft\",\"m\"),Inputs!B21))","v":12.4968},{"$f":"IF(Inputs!G21=\"\",\"\",IF(units=2,CONVERT(Inputs!G21,\"ft\",\"m\"),Inputs!G21))","v":2.4384000000000001},"Not_susc.",{"$f":"IF(A44=\"\",NA(),'PB Liquefaction Initiation'!D51)","v":4.144728715335928},{"$f":"EXP(('PB Liquefaction Initiation'!J51-(29.06*LN(7.5))+15.25)/13.79)","v":{"$error":"#N/A"}},26.282848384881248,{"$f":"_xlfn.NORM.S.DIST(-(D44-'PB Liquefaction Initiation'!J51)/4.21,TRUE)","v":{"$error":"#N/A"}},{"$error":"#N/A"},null,null,null,null,17.79,1.5214228636759974,54.451813560247928,0.9999999999999476,2.9509540888956992E-2,null,null,null,null,{"$error":"#N/A"},{"$error":"#N/A"},{"$error":"#N/A"},{"$error":"#N/A"},0.3057333333333333,{"$error":"#N/A"},{"$error":"#N/A"},null,null,{"$error":"#N/A"},null,{"$error":"#N/A"},{"$error":"#N/A"},6.429990739132375]
[{"$f":"IF(Inputs!B22=\"\",\"\",IF(units=2,CONVERT(Inputs!B22,\"ft\",\"m\"),Inputs!B22))","v":13.715999999999999},{"$f":"IF(Inputs!G22=\"\",\"\",IF(units=2,CONVERT(Inputs!G22,\"ft\",\"m\"),Inputs!G22))","v":0.91439999999999999},"Susceptible",{"$f":"IF(A45=\"\",NA(),'PB Liquefaction Initiation'!D52)","v":2.0632593460236448},{"$f":"EXP(('PB Liquefaction Initiation'!J52-(29.06*LN(7.5))+15.25)/13.79)","v":1.4782441445282972},18.543908910221909,{"$f":"_xlfn.NORM.S.DIST(-(D45-'PB Liquefaction Initiation'!J52)/4.21,TRUE)","v":1},6.9344511674821543E-2,null,null,null,null,17.79,1.5214228636759974,54.451813560247928,0.9999999999999476,2.9509540888956992E-2,null,null,null,null,0.78421197430728073,5.8897092037539227E-2,7.5211467965867224E-2,7.5211467965867227,0.23799999999999999,1.6368061181301376E-2,0.21762719999999999,null,null,0.25643295850705494,null,3.4802685572278773E-2,3.6597112040385458,6.429990739132375]
[{"$f":"IF(Inputs!B23=\"\",\"\",IF(units=2,CONVERT(Inputs!B23,\"ft\",\"m\"),Inputs!B23))","v":15.6972},{"$f":"IF(Inputs!G23=\"\",\"\",IF(units=2,CONVERT(Inputs!G23,\"ft\",\"m\"),Inputs!G23))","v":2.1335999999999999},"Susceptible",{"$f":"IF(A46=\"\",NA(),'PB Liquefaction Initiation'!D53)","v":10.322847584760181},{"$f":"EXP(('PB Liquefaction Initiation'!J53-(29.06*LN(7.5))+15.25)/13.79)","v":1.4330098467419019},41.47860409247194,{"$f":"_xlfn.NORM.S.DIST(-(D46-'PB Liquefaction Initiation'!J53)/4.21,TRUE)","v":1},3.9738238180199864E-2,null,null,null,null,17.79,1.5214228636759974,54.451813560247928,0.9999999999999476,2.9509540888956992E-2,null,null,null,null,0.92874755511920781,3.2079778365393621E-2,3.5210793135788454E-2,3.5210793135788454,0.12793333333333334,9.6110873908027018E-3,0.27295856000000002,null,null,6.4531586766818139E-2,null,8.7581274138909468E-3,2.1489291747819381,2.7702795350938296]
[{"$f":"IF(Inputs!B24=\"\",\"\",IF(units=2,CONVERT(Inputs!B24,\"ft\",\"m\"),Inputs!B24))","v":17.3736},{"$f":"IF(Inputs!G24=\"\",\"\",IF(units=2,CONVERT(Inputs!G24,\"ft\",\"m\"),Inputs!G24))","v":1.2192000000000001},"Susceptible",{"$f":"IF(A47=\"\",NA(),'PB Liquefaction Initiation'!D54)","v":2.9720420997108414},{"$f":"EXP(('PB Liquefaction Initiation'!J54-(29.06*LN(7.5))+15.25)/13.79)","v":1.4189817079355038},22.256242943313836,{"$f":"_xlfn.NORM.S.DIST(-(D47-'PB Liquefaction Initiation'!J54)/4.21,TRUE)","v":1},6.2833715590873598E-2,null,null,null,null,17.79,1.5214228636759974,54.451813560247928,0.9999999999999476,2.9509540888956992E-2,null,null,null,null,0.81070985661644834,5.2942595661078652E-2,6.549871513373251E-2,6.549871513373251,3.4800000000000053E-2,2.7789899654884287E-3,4.2428160000000069E-2,null,null,3.2653132094489043E-2,null,4.4316327193305062E-3,0.62135036031189161,0.62135036031189161]
[{"$f":"IF(Inputs!B25=\"\",\"\",IF(units=2,CONVERT(Inputs!B25,\"ft\",\"m\"),Inputs!B25))","v":""},{"$f":"IF(Inputs!G25=\"\",\"\",IF(units=2,CONVERT(Inputs!G25,\"ft\",\"m\"),Inputs!G25))","v":""},"",{"$f":"IF(A48=\"\",NA(),'PB Liquefaction Initiation'!D55)","v":{"$error":"#N/A"}},{"$f":"EXP(('PB Liquefaction Initiation'!J55-(29.06*LN(7.5))+15.25)/13.79)","v":{"$error":"#N/A"}},{"$error":"#N/A"},{"$f":"_xlfn.NORM.S.DIST(-(D48-'PB Liquefaction Initiation'!J55)/4.21,TRUE)","v":{"$error":"#N/A"}},{"$error":"#N/A"},null,null,null,null,{"$error":"#N/A"},{"$error":"#N/A"},{"$error":"#N/A"},{"$error":"#N/A"},{"$error":"#N/A"},null,null,null,null,{"$error":"#N/A"},{"$error":"#N/A"},{"$error":"#N/A"},{"$error":"#N/A"},{"$error":"#N/A"},{"$error":"#N/A"},{"$error":"#N/A"},null,null,{"$error":"#N/A"},null,{"$error":"#N/A"},{"$error":"#N/A"},0]
[{"$f":"IF(Inputs!B26=\"\",\"\",IF(units=2,CONVERT(Inputs!B26,\"ft\",\"m\"),Inputs!B26))","v":""},{"$f":"IF(Inputs!G26=\"\",\"\",IF(units=2,CONVERT(Inputs!G26,\"ft\",\"m\"),Inputs!G26))","v":""},"",{"$f":"IF(A49=\"\",NA(),'PB Liquefaction Initiation'!D56)","v":{"$error":"#N/A"}},{"$f":"EXP(('PB Liquefaction Initiation'!J56-(29.06*LN(7.5))+15.25)/13.79)","v":{"$error":"#N/A"}},{"$error":"#N/A"},{"$f":"_xlfn.NORM.S.DIST(-(D49-'PB Liquefaction Initiation'!J56)/4.21,TRUE)","v":{"$error":"#N/A"}},{"$error":"#N/A"},null,null,null,null,{"$error":"#N/A"},{"$error":"#N/A"},{"$error":"#N/A"},{"$error":"#N/A"},{"$error":"#N/A"},null,null,null,null,{"$error":"#N/A"},{"$error":"#N/A"},{"$error":"#N/A"},{"$error":"#N/A"},{"$error":"#N/A"},{"$error":"#N/A"},{"$error":"#N/A"},null,null,{"$error":"#N/A"},null,{"$error":"#N/A"},{"$error":"#N/A"},0]
[{"$f":"IF(Inputs!B27=\"\",\"\",IF(units=2,CONVERT(Inputs!B27,\"ft\",\"m\"),Inputs!B27))","v":""},{"$f":"IF(Inputs!G27=\"\",\"\",IF(units=2,CONVERT(Inputs!G27,\"ft\",\"m\"),Inputs!G27))","v":""},"",{"$f":"IF(A50=\"\",NA(),'PB Liquefaction Initiation'!D57)","v":{"$error":"#N/A"}},{"$f":"EXP(('PB Liquefaction Initiation'!J57-(29.06*LN(7.5))+15.25)/13.79)","v":{"$error":"#N/A"}},{"$error":"#N/A"},{"$f":"_xlfn.NORM.S.DIST(-(D50-'PB Liquefaction Initiation'!J57)/4.21,TRUE)","v":{"$error":"#N/A"}},{"$error":"#N/A"},null,null,null,null,{"$error":"#N/A"},{"$error":"#N/A"},{"$error":"#N/A"},{"$error":"#N/A"},{"$error":"#N/A"},null,null,null,null,{"$error":"#N/A"},{"$error":"#N/A"},{"$error":"#N/A"},{"$error":"#N/A"},{"$error":"#N/A"},{"$error":"#N/A"},{"$error":"#N/A"},null,null,{"$error":"#N/A"},null,{"$error":"#N/A"},{"$error":"#N/A"},0]
[{"$f":"IF(Inputs!B28=\"\",\"\",IF(units=2,CONVERT(Inputs!B28,\"ft\",\"m\"),Inputs!B28))","v":""},{"$f":"IF(Inputs!G28=\"\",\"\",IF(units=2,CONVERT(Inputs!G28,\"ft\",\"m\"),Inputs!G28))","v":""},"",{"$f":"IF(A51=\"\",NA(),'PB Liquefaction Initiation'!D58)","v":{"$error":"#N/A"}},{"$f":"EXP(('PB Liquefaction Initiation'!J58-(29.06*LN(7.5))+15.25)/13.79)","v":{"$error":"#N/A"}},{"$error":"#N/A"},{"$f":"_xlfn.NORM.S.DIST(-(D51-'PB Liquefaction Initiation'!J58)/4.21,TRUE)","v":{"$error":"#N/A"}},{"$error":"#N/A"},null,null,null,null,{"$error":"#N/A"},{"$error":"#N/A"},{"$error":"#N/A"},{"$error":"#N/A"},{"$error":"#N/A"},null,null,null,null,{"$error":"#N/A"},{"$error":"#N/A"},{"$error":"#N/A"},{"$error":"#N/A"},{"$error":"#N/A"},{"$error":"#N/A"},{"$error":"#N/A"},null,null,{"$error":"#N/A"},null,{"$error":"#N/A"},{"$error":"#N/A"},0]
[{"$f":"IF(Inputs!B29=\"\",\"\",IF(units=2,CONVERT(Inputs!B29,\"ft\",\"m\"),Inputs!B29))","v":""},{"$f":"IF(Inputs!G29=\"\",\"\",IF(units=2,CONVERT(Inputs!G29,\"ft\",\"m\"),Inputs!G29))","v":""},"",{"$f":"IF(A52=\"\",NA(),'PB Liquefaction Initiation'!D59)","v":{"$error":"#N/A"}},{"$f":"EXP(('PB Liquefaction Initiation'!J59-(29.06*LN(7.5))+15.25)/13.79)","v":{"$error":"#N/A"}},{"$error":"#N/A"},{"$f":"_xlfn.NORM.S.DIST(-(D52-'PB Liquefaction Initiation'!J59)/4.21,TRUE)","v":{"$error":"#N/A"}},{"$error":"#N/A"},null,null,null,null,{"$error":"#N/A"},{"$error":"#N/A"},{"$error":"#N/A"},{"$error":"#N/A"},{"$error":"#N/A"},null,null,null,null,{"$error":"#N/A"},{"$error":"#N/A"},{"$error":"#N/A"},{"$error":"#N/A"},{"$error":"#N/A"},{"$error":"#N/A"},{"$error":"#N/A"},null,null,{"$error":"#N/A"},null,{"$error":"#N/A"},{"$error":"#N/A"},0]
[{"$f":"IF(Inputs!B30=\"\",\"\",IF(units=2,CONVERT(Inputs!B30,\"ft\",\"m\"),Inputs!B30))","v":""},{"$f":"IF(Inputs!G30=\"\",\"\",IF(units=2,CONVERT(Inputs!G30,\"ft\",\"m\"),Inputs!G30))","v":""},"",{"$f":"IF(A53=\"\",NA(),'PB Liquefaction Initiation'!D60)","v":{"$error":"#N/A"}},{"$f":"EXP(('PB Liquefaction Initiation'!J60-(29.06*LN(7.5))+15.25)/13.79)","v":{"$error":"#N/A"}},{"$error":"#N/A"},{"$f":"_xlfn.NORM.S.DIST(-(D53-'PB Liquefaction Initiation'!J60)/4.21,TRUE)","v":{"$error":"#N/A"}},{"$error":"#N/A"},null,null,null,null,{"$error":"#N/A"},{"$error":"#N/A"},{"$error":"#N/A"},{"$error":"#N/A"},{"$error":"#N/A"},null,null,null,null,{"$error":"#N/A"},{"$error":"#N/A"},{"$error":"#N/A"},{"$error":"#N/A"},{"$error":"#N/A"},{"$error":"#N/A"},{"$error":"#N/A"},null,null,{"$error":"#N/A"},null,{"$error":"#N/A"},{"$error":"#N/A"},0]
[{"$f":"IF(Inputs!B31=\"\",\"\",IF(units=2,CONVERT(Inputs!B31,\"ft\",\"m\"),Inputs!B31))","v":""},{"$f":"IF(Inputs!G31=\"\",\"\",IF(units=2,CONVERT(Inputs!G31,\"ft\",\"m\"),Inputs!G31))","v":""},"",{"$f":"IF(A54=\"\",NA(),'PB Liquefaction Initiation'!D61)","v":{"$error":"#N/A"}},{"$f":"EXP(('PB Liquefaction Initiation'!J61-(29.06*LN(7.5))+15.25)/13.79)","v":{"$error":"#N/A"}},{"$error":"#N/A"},{"$f":"_xlfn.NORM.S.DIST(-(D54-'PB Liquefaction Initiation'!J61)/4.21,TRUE)","v":{"$error":"#N/A"}},{"$error":"#N/A"},null,null,null,null,{"$error":"#N/A"},{"$error":"#N/A"},{"$error":"#N/A"},{"$error":"#N/A"},{"$error":"#N/A"},null,null,null,null,{"$error":"#N/A"},{"$error":"#N/A"},{"$error":"#N/A"},{"$error":"#N/A"},{"$error":"#N/A"},{"$error":"#N/A"},{"$error":"#N/A"},null,null,{"$error":"#N/A"},null,{"$error":"#N/A"},{"$error":"#N/A"},0]
[{"$f":"IF(Inputs!B32=\"\",\"\",IF(units=2,CONVERT(Inputs!B32,\"ft\",\"m\"),Inputs!B32))","v":""},{"$f":"IF(Inputs!G32=\"\",\"\",IF(units=2,CONVERT(Inputs!G32,\"ft\",\"m\"),Inputs!G32))","v":""},"",{"$f":"IF(A55=\"\",NA(),'PB Liquefaction Initiation'!D62)","v":{"$error":"#N/A"}},{"$f":"EXP(('PB Liquefaction Initiation'!J62-(29.06*LN(7.5))+15.25)/13.79)","v":{"$error":"#N/A"}},{"$error":"#N/A"},{"$f":"_xlfn.NORM.S.DIST(-(D55-'PB Liquefaction Initiation'!J62)/4.21,TRUE)","v":{"$error":"#N/A"}},{"$error":"#N/A"},null,null,null,null,{"$error":"#N/A"},{"$error":"#N/A"},{"$error":"#N/A"},{"$error":"#N/A"},{"$error":"#N/A"},null,null,null,null,{"$error":"#N/A"},{"$error":"#N/A"},{"$error":"#N/A"},{"$error":"#N/A"},{"$error":"#N/A"},{"$error":"#N/A"},{"$error":"#N/A"},null,null,{"$error":"#N/A"},null,{"$error":"#N/A"},{"$error":"#N/A"},{"$f":"IF(OR(C55=\"\",C55=\"Not_susc.\"),0,AH55)","v":0}]

{"sheet":"Det Settlement","index":7,"n_rows":52,"n_cols":21,"rows_kept":52,"cut":false,"hidden":false,"merged":[[30,11,30,15],[30,16,30,20],[30,3,30,6],[4,3,4,10],[4,11,4,15],[4,16,4,20]]}
["Simplified Performance-based Settlement using Ishihara & Yoshimine (1992)"]
[]
["Depth to Water:",{"$f":"IF(design_gw=\"\",NA(),IF(units=2,CONVERT(design_gw,\"ft\",\"m\"),design_gw))","v":0},"m"]
[]
[null,null,null,"Compute Deterministic Vertical Strain",null,null,null,null,null,null,null,"Compute Ground Surface Settlment",null,null,null,null,"Compute Settlement for Each Layer"]
["Depth (m)","Thickness (m)","Susceptible?","(N1)60,Cssite","CRR(Nsite)","CSRsite","FSLsite","Fαsite","γLIMsite","γMAXsite","εvsite","DFi","ε*t*DFi","t*DFi","εv,eqv.site","Ssite (m)","εi*Dfi*Σti","Σ(ti*DFi)","εisite","Si (cm)","Ssite (cm)"]
[{"$f":"IF(Inputs!B13=\"\",\"\",IF(units=2,CONVERT(Inputs!B13,\"ft\",\"m\"),Inputs!B13))","v":0.4572},{"$f":"IF(Inputs!G13=\"\",\"\",IF(units=2,CONVERT(Inputs!G13,\"ft\",\"m\"),Inputs!G13))","v":0.91439999999999999},{"$f":"IF(A7=\"\",\"\",IF(OR(A7<$B$3,Inputs!J13=\"No\"),\"Not_susc.\",\"Susceptible\"))","v":"Susceptible"},{"$f":"IF(OR(A7=\"\",Method_BI=FALSE),NA(),'PB Liquefaction Initiation'!F10)","v":33.874185446686866},{"$f":"IF(OR(A7=\"\",Method_BI=FALSE),NA(),'Det Liquefaction Initiation'!T10)","v":0.76751784001212797},{"$f":"IF('PB Liquefaction Initiation'!P10=\"\",NA(),'Det Liquefaction Initiation'!S10)","v":0.41396383811397325},{"$f":"E7/F7","v":1.8540697745700523},{"$f":"0.032+(0.69*SQRT(D7))-(0.13*D7)","v":-0.3557382711294359},{"$f":"MAX(0,1.859*(1.1-SQRT(D7/46))^3)","v":2.6302652334095056E-2},{"$f":"IF(G7<H7,I7,IF(G7<2,MIN(I7,0.035*(2-G7)*((1-H7)/(G7-H7))),0))","v":3.1335353842263454E-3},{"$f":"MAX(0,1.5*EXP(-0.369*SQRT(D7))*MIN(0.08,J7))","v":5.4880636270346491E-4},{"$f":"IF(A7=\"\",NA(),MAX(0,1-(A7/18)))","v":0.97460000000000002},{"$f":"K7*B7*L7","v":4.8908209318942477E-4},{"$f":"IF(OR(A7=\"\",C7=\"Not_susc.\"),NA(),B7*L7)","v":0.89117424000000001},{"$f":"SUMIFS(M7:M26,C7:C26,\"=Susceptible\",A7:A26,\"<18\")/SUMIFS(N7:N26,C7:C26,\"=Susceptible\",A7:A26,\"<18\")","v":2.5374651734903386E-2},{"$f":"0.9*O7*SUMIFS(B7:B26,C7:C26,\"=Susceptible\",A7:A26,\"<18\")","v":0.32715639980417877},{"$f":"K7*L7*SUMIFS($B$7:$B$26,$C$7:$C$26,\"=Susceptible\",$A$7:$A$26,\"<18\")","v":7.6622861266343201E-3},{"$f":"SUMIF(C7:C26,\"=Susceptible\",N7:$N$26)","v":7.3681945600000001},{"$f":"Q7/$R$7","v":1.0399136537776656E-3},{"$f":"0.9*S7*B7*100","v":8.5580734051286772E-2},{"$f":"SUMIF(C7:C26,\"=Susceptible\",(T7:T26))","v":32.715639980417883}]
[{"$f":"IF(Inputs!B14=\"\",\"\",IF(units=2,CONVERT(Inputs!B14,\"ft\",\"m\"),Inputs!B14))","v":1.6763999999999999},{"$f":"IF(Inputs!G14=\"\",\"\",IF(units=2,CONVERT(Inputs!G14,\"ft\",\"m\"),Inputs!G14))","v":1.524},{"$f":"IF(A8=\"\",\"\",IF(OR(A8<$B$3,Inputs!J14=\"No\"),\"Not_susc.\",\"Susceptible\"))","v":"Susceptible"},{"$f":"IF(OR(A8=\"\",Method_BI=FALSE),NA(),'PB Liquefaction Initiation'!F11)","v":11.900438780020192},{"$f":"IF(OR(A8=\"\",Method_BI=FALSE),NA(),'Det Liquefaction Initiation'!T11)","v":0.11388395869028091},{"$f":"IF('PB Liquefaction Initiation'!P11=\"\",NA(),'Det Liquefaction Initiation'!S11)","v":0.75372797671486647},{"$f":"E8/F8","v":0.15109424382340919},{"$f":"0.032+(0.69*SQRT(D8))-(0.13*D8)","v":0.86523682767480725},{"$f":"MAX(0,1.859*(1.1-SQRT(D8/46))^3)","v":0.38446402727397266},{"$f":"IF(G8<H8,I8,IF(G8<2,MIN(I8,0.035*(2-G8)*((1-H8)/(G8-H8))),0))","v":0.38446402727397266},{"$f":"MAX(0,1.5*EXP(-0.369*SQRT(D8))*MIN(0.08,J8))","v":3.3600870622404452E-2},0.90686666666666671,{"$f":"K8*B8*L8","v":4.6438580536579288E-2},1.3820648,null,null,{"$f":"K8*L8*SUMIFS($B$7:$B$26,$C$7:$C$26,\"=Susceptible\",$A$7:$A$26,\"<18\")","v":0.43652265704384535},null,5.9244181663390461E-2,8.1259319569506356,{"$f":"IF(OR(C8=\"\",C8=\"Not_susc.\"),U9,U9+T8)","v":32.630059246366599}]
[{"$f":"IF(Inputs!B15=\"\",\"\",IF(units=2,CONVERT(Inputs!B15,\"ft\",\"m\"),Inputs!B15))","v":3.2004000000000001},{"$f":"IF(Inputs!G15=\"\",\"\",IF(units=2,CONVERT(Inputs!G15,\"ft\",\"m\"),Inputs!G15))","v":1.524},{"$f":"IF(A9=\"\",\"\",IF(OR(A9<$B$3,Inputs!J15=\"No\"),\"Not_susc.\",\"Susceptible\"))","v":"Susceptible"},{"$f":"IF(OR(A9=\"\",Method_BI=FALSE),NA(),'PB Liquefaction Initiation'!F12)","v":13.693403668256009},{"$f":"IF(OR(A9=\"\",Method_BI=FALSE),NA(),'Det Liquefaction Initiation'!T12)","v":0.12576223947958012},{"$f":"IF('PB Liquefaction Initiation'!P12=\"\",NA(),'Det Liquefaction Initiation'!S12)","v":0.76658707737983955},0.16405473453769903,0.80517487246986019,0.31676842571943614,0.31676842571943614,3.0631289826677052E-2,0.82220000000000004,{"$f":"K9*B9*L9","v":3.8382010859132662E-2},1.2530328000000002,null,null,0.36079090207584708,null,4.8965984697864312E-2,6.7161744611590706,24.504127289415962]
[{"$f":"IF(Inputs!B16=\"\",\"\",IF(units=2,CONVERT(Inputs!B16,\"ft\",\"m\"),Inputs!B16))","v":4.5720000000000001},{"$f":"IF(Inputs!G16=\"\",\"\",IF(units=2,CONVERT(Inputs!G16,\"ft\",\"m\"),Inputs!G16))","v":1.2192000000000001},{"$f":"IF(A10=\"\",\"\",IF(OR(A10<$B$3,Inputs!J16=\"No\"),\"Not_susc.\",\"Susceptible\"))","v":"Not_susc."},{"$f":"IF(OR(A10=\"\",Method_BI=FALSE),NA(),'PB Liquefaction Initiation'!F13)","v":7.5891695726420965},{"$f":"IF(OR(A10=\"\",Method_BI=FALSE),NA(),'Det Liquefaction Initiation'!T13)","v":8.8135265298010565E-2},{"$f":"IF('PB Liquefaction Initiation'!P13=\"\",NA(),'Det Liquefaction Initiation'!S13)","v":{"$error":"#N/A"}},{"$error":"#N/A"},0.9462508300558643,0.62089819936744439,{"$error":"#N/A"},{"$error":"#N/A"},0.746,{"$error":"#N/A"},{"$error":"#N/A"},null,null,{"$error":"#N/A"},null,{"$error":"#N/A"},{"$error":"#N/A"},17.787952828256891]
[{"$f":"IF(Inputs!B17=\"\",\"\",IF(units=2,CONVERT(Inputs!B17,\"ft\",\"m\"),Inputs!B17))","v":6.2484000000000002},{"$f":"IF(Inputs!G17=\"\",\"\",IF(units=2,CONVERT(Inputs!G17,\"ft\",\"m\"),Inputs!G17))","v":2.1335999999999999},{"$f":"IF(A11=\"\",\"\",IF(OR(A11<$B$3,Inputs!J17=\"No\"),\"Not_susc.\",\"Susceptible\"))","v":"Susceptible"},{"$f":"IF(OR(A11=\"\",Method_BI=FALSE),NA(),'PB Liquefaction Initiation'!F14)","v":21.708473911296679},{"$f":"IF(OR(A11=\"\",Method_BI=FALSE),NA(),'Det Liquefaction Initiation'!T14)","v":0.19771613422431597},{"$f":"IF('PB Liquefaction Initiation'!P14=\"\",NA(),'Det Liquefaction Initiation'!S14)","v":0.71468998628801128},0.27664601158220065,0.4247707730060597,0.13098886049804351,0.13098886049804351,2.1503891182567014E-2,0.65286666666666671,2.9953981127348997E-2,1.3929563200000001,null,null,0.20111958756934328,null,2.7295640191312115E-2,5.241418012096517,17.787952828256891]
[{"$f":"IF(Inputs!B18=\"\",\"\",IF(units=2,CONVERT(Inputs!B18,\"ft\",\"m\"),Inputs!B18))","v":7.7724000000000002},{"$f":"IF(Inputs!G18=\"\",\"\",IF(units=2,CONVERT(Inputs!G18,\"ft\",\"m\"),Inputs!G18))","v":0.91439999999999999},{"$f":"IF(A12=\"\",\"\",IF(OR(A12<$B$3,Inputs!J18=\"No\"),\"Not_susc.\",\"Susceptible\"))","v":"Susceptible"},{"$f":"IF(OR(A12=\"\",Method_BI=FALSE),NA(),'PB Liquefaction Initiation'!F15)","v":29.14039966028972},{"$f":"IF(OR(A12=\"\",Method_BI=FALSE),NA(),'Det Liquefaction Initiation'!T15)","v":0.37702115698943778},{"$f":"IF('PB Liquefaction Initiation'!P15=\"\",NA(),'Det Liquefaction Initiation'!S15)","v":0.64883549021389109},0.58107357361902523,-3.1504410263074156E-2,5.2269401579537765E-2,5.2269401579537765E-2,1.06968151001814E-2,0.56820000000000004,5.5576595028256565E-3,0.51956208000000004,null,null,8.7069998877601973E-2,null,1.1817005939322261E-2,0.97249232078246484,12.546534816160372]
[{"$f":"IF(Inputs!B19=\"\",\"\",IF(units=2,CONVERT(Inputs!B19,\"ft\",\"m\"),Inputs!B19))","v":9.2964000000000002},{"$f":"IF(Inputs!G19=\"\",\"\",IF(units=2,CONVERT(Inputs!G19,\"ft\",\"m\"),Inputs!G19))","v":2.1335999999999999},{"$f":"IF(A13=\"\",\"\",IF(OR(A13<$B$3,Inputs!J19=\"No\"),\"Not_susc.\",\"Susceptible\"))","v":"Susceptible"},{"$f":"IF(OR(A13=\"\",Method_BI=FALSE),NA(),'PB Liquefaction Initiation'!F16)","v":21.337630575889257},{"$f":"IF(OR(A13=\"\",Method_BI=FALSE),NA(),'Det Liquefaction Initiation'!T16)","v":0.19309849493023551},{"$f":"IF('PB Liquefaction Initiation'!P16=\"\",NA(),'Det Liquefaction Initiation'!S16)","v":0.71089441090745842},0.27162753281988083,0.44540247610388173,0.13667589506107522,0.13667589506107522,2.1823385007261883E-2,0.48353333333333337,2.2514460029739045E-2,1.03166672,null,null,0.15116851734253359,null,2.0516357991303313E-2,3.9396331269220273,11.574042495377908]
[{"$f":"IF(Inputs!B20=\"\",\"\",IF(units=2,CONVERT(Inputs!B20,\"ft\",\"m\"),Inputs!B20))","v":10.820399999999999},{"$f":"IF(Inputs!G20=\"\",\"\",IF(units=2,CONVERT(Inputs!G20,\"ft\",\"m\"),Inputs!G20))","v":0.91439999999999999},{"$f":"IF(A14=\"\",\"\",IF(OR(A14<$B$3,Inputs!J20=\"No\"),\"Not_susc.\",\"Susceptible\"))","v":"Susceptible"},{"$f":"IF(OR(A14=\"\",Method_BI=FALSE),NA(),'PB Liquefaction Initiation'!F17)","v":9.4876390112066709},{"$f":"IF(OR(A14=\"\",Method_BI=FALSE),NA(),'Det Liquefaction Initiation'!T17)","v":9.9021367248716616E-2},{"$f":"IF('PB Liquefaction Initiation'!P17=\"\",NA(),'Det Liquefaction Initiation'!S17)","v":0.76226618833284232},0.12990392170651952,0.92394570935796927,0.50080955459082255,0.50080955459082255,3.8509213533282551E-2,0.3988666666666667,1.4045222073764614E-2,0.36472368000000005,null,null,0.220041812488979,null,2.9863735369248853E-2,2.4576659659477036,7.6344093684558807]
[{"$f":"IF(Inputs!B21=\"\",\"\",IF(units=2,CONVERT(Inputs!B21,\"ft\",\"m\"),Inputs!B21))","v":12.4968},{"$f":"IF(Inputs!G21=\"\",\"\",IF(units=2,CONVERT(Inputs!G21,\"ft\",\"m\"),Inputs!G21))","v":2.4384000000000001},{"$f":"IF(A15=\"\",\"\",IF(OR(A15<$B$3,Inputs!J21=\"No\"),\"Not_susc.\",\"Susceptible\"))","v":"Not_susc."},{"$f":"IF(OR(A15=\"\",Method_BI=FALSE),NA(),'PB Liquefaction Initiation'!F18)","v":7.3030476983682764},{"$f":"IF(OR(A15=\"\",Method_BI=FALSE),NA(),'Det Liquefaction Initiation'!T18)","v":8.6556517762789179E-2},{"$f":"IF('PB Liquefaction Initiation'!P18=\"\",NA(),'Det Liquefaction Initiation'!S18)","v":{"$error":"#N/A"}},{"$error":"#N/A"},0.94727025978708057,0.64188382601693383,{"$error":"#N/A"},{"$error":"#N/A"},0.3057333333333333,{"$error":"#N/A"},{"$error":"#N/A"},null,null,{"$error":"#N/A"},null,{"$error":"#N/A"},{"$error":"#N/A"},5.1767434025081771]
[{"$f":"IF(Inputs!B22=\"\",\"\",IF(units=2,CONVERT(Inputs!B22,\"ft\",\"m\"),Inputs!B22))","v":13.715999999999999},{"$f":"IF(Inputs!G22=\"\",\"\",IF(units=2,CONVERT(Inputs!G22,\"ft\",\"m\"),Inputs!G22))","v":0.91439999999999999},{"$f":"IF(A16=\"\",\"\",IF(OR(A16<$B$3,Inputs!J22=\"No\"),\"Not_susc.\",\"Susceptible\"))","v":"Susceptible"},{"$f":"IF(OR(A16=\"\",Method_BI=FALSE),NA(),'PB Liquefaction Initiation'!F19)","v":1.6327566637818389},{"$f":"IF(OR(A16=\"\",Method_BI=FALSE),NA(),'Det Liquefaction Initiation'!T19)","v":5.902391093603223E-2},{"$f":"IF('PB Liquefaction Initiation'!P19=\"\",NA(),'Det Liquefaction Initiation'!S19)","v":0.73623162212844251},8.0170301250297227E-2,0.70141926619459649,1.4082889447337894,1.4082889447337894,7.4887416952984315E-2,0.23799999999999999,1.6297538866710509E-2,0.21762719999999999,null,null,0.25532810891179797,null,3.4652737089477449E-2,2.851781651515636,5.1767434025081771]
[{"$f":"IF(Inputs!B23=\"\",\"\",IF(units=2,CONVERT(Inputs!B23,\"ft\",\"m\"),Inputs!B23))","v":15.6972},{"$f":"IF(Inputs!G23=\"\",\"\",IF(units=2,CONVERT(Inputs!G23,\"ft\",\"m\"),Inputs!G23))","v":2.1335999999999999},{"$f":"IF(A17=\"\",\"\",IF(OR(A17<$B$3,Inputs!J23=\"No\"),\"Not_susc.\",\"Susceptible\"))","v":"Susceptible"},{"$f":"IF(OR(A17=\"\",Method_BI=FALSE),NA(),'PB Liquefaction Initiation'!F20)","v":9.6599215676559655},{"$f":"IF(OR(A17=\"\",Method_BI=FALSE),NA(),'Det Liquefaction Initiation'!T20)","v":0.1000440759527092},{"$f":"IF('PB Liquefaction Initiation'!P20=\"\",NA(),'Det Liquefaction Initiation'!S20)","v":0.69886017471582129},0.14315320799813824,0.92075878701841929,0.49132111759457353,0.49132111759457353,3.8115630712108904E-2,0.12793333333333334,1.0403987672669021E-2,0.27295856000000002,null,null,6.9855345802206301E-2,null,9.4806597780998734E-3,1.82051421322985,2.3249617509925411]
[{"$f":"IF(Inputs!B24=\"\",\"\",IF(units=2,CONVERT(Inputs!B24,\"ft\",\"m\"),Inputs!B24))","v":17.3736},{"$f":"IF(Inputs!G24=\"\",\"\",IF(units=2,CONVERT(Inputs!G24,\"ft\",\"m\"),Inputs!G24))","v":1.2192000000000001},{"$f":"IF(A18=\"\",\"\",IF(OR(A18<$B$3,Inputs!J24=\"No\"),\"Not_susc.\",\"Susceptible\"))","v":"Susceptible"},{"$f":"IF(OR(A18=\"\",Method_BI=FALSE),NA(),'PB Liquefaction Initiation'!F21)","v":2.3758590121854533},{"$f":"IF(OR(A18=\"\",Method_BI=FALSE),NA(),'Det Liquefaction Initiation'!T21)","v":6.2190539434566962E-2},{"$f":"IF('PB Liquefaction Initiation'!P21=\"\",NA(),'Det Liquefaction Initiation'!S21)","v":0.68217702333422126},9.1164811049488759E-2,0.7866920297876151,1.2357410117235026,1.2357410117235026,6.7946573998271212E-2,3.4800000000000053E-2,2.8828481130504951E-3,4.2428160000000069E-2,null,null,3.3873465328343316E-2,null,4.5972544634249341E-3,0.50444753776269124,0.50444753776269124]
[{"$f":"IF(Inputs!B25=\"\",\"\",IF(units=2,CONVERT(Inputs!B25,\"ft\",\"m\"),Inputs!B25))","v":""},{"$f":"IF(Inputs!G25=\"\",\"\",IF(units=2,CONVERT(Inputs!G25,\"ft\",\"m\"),Inputs!G25))","v":""},{"$f":"IF(A19=\"\",\"\",IF(OR(A19<$B$3,Inputs!J25=\"No\"),\"Not_susc.\",\"Susceptible\"))","v":""},{"$f":"IF(OR(A19=\"\",Method_BI=FALSE),NA(),'PB Liquefaction Initiation'!F22)","v":{"$error":"#N/A"}},{"$f":"IF(OR(A19=\"\",Method_BI=FALSE),NA(),'Det Liquefaction Initiation'!T22)","v":{"$error":"#N/A"}},{"$f":"IF('PB Liquefaction Initiation'!P22=\"\",NA(),'Det Liquefaction Initiation'!S22)","v":{"$error":"#N/A"}},{"$error":"#N/A"},{"$error":"#N/A"},{"$error":"#N/A"},{"$error":"#N/A"},{"$error":"#N/A"},{"$error":"#N/A"},{"$error":"#N/A"},{"$error":"#N/A"},null,null,{"$error":"#N/A"},null,{"$error":"#N/A"},{"$error":"#N/A"},0]
[{"$f":"IF(Inputs!B26=\"\",\"\",IF(units=2,CONVERT(Inputs!B26,\"ft\",\"m\"),Inputs!B26))","v":""},{"$f":"IF(Inputs!G26=\"\",\"\",IF(units=2,CONVERT(Inputs!G26,\"ft\",\"m\"),Inputs!G26))","v":""},{"$f":"IF(A20=\"\",\"\",IF(OR(A20<$B$3,Inputs!J26=\"No\"),\"Not_susc.\",\"Susceptible\"))","v":""},{"$f":"IF(OR(A20=\"\",Method_BI=FALSE),NA(),'PB Liquefaction Initiation'!F23)","v":{"$error":"#N/A"}},{"$f":"IF(OR(A20=\"\",Method_BI=FALSE),NA(),'Det Liquefaction Initiation'!T23)","v":{"$error":"#N/A"}},{"$f":"IF('PB Liquefaction Initiation'!P23=\"\",NA(),'Det Liquefaction Initiation'!S23)","v":{"$error":"#N/A"}},{"$error":"#N/A"},{"$error":"#N/A"},{"$error":"#N/A"},{"$error":"#N/A"},{"$error":"#N/A"},{"$error":"#N/A"},{"$error":"#N/A"},{"$error":"#N/A"},null,null,{"$error":"#N/A"},null,{"$error":"#N/A"},{"$error":"#N/A"},0]
[{"$f":"IF(Inputs!B27=\"\",\"\",IF(units=2,CONVERT(Inputs!B27,\"ft\",\"m\"),Inputs!B27))","v":""},{"$f":"IF(Inputs!G27=\"\",\"\",IF(units=2,CONVERT(Inputs!G27,\"ft\",\"m\"),Inputs!G27))","v":""},{"$f":"IF(A21=\"\",\"\",IF(OR(A21<$B$3,Inputs!J27=\"No\"),\"Not_susc.\",\"Susceptible\"))","v":""},{"$f":"IF(OR(A21=\"\",Method_BI=FALSE),NA(),'PB Liquefaction Initiation'!F24)","v":{"$error":"#N/A"}},{"$f":"IF(OR(A21=\"\",Method_BI=FALSE),NA(),'Det Liquefaction Initiation'!T24)","v":{"$error":"#N/A"}},{"$f":"IF('PB Liquefaction Initiation'!P24=\"\",NA(),'Det Liquefaction Initiation'!S24)","v":{"$error":"#N/A"}},{"$error":"#N/A"},{"$error":"#N/A"},{"$error":"#N/A"},{"$error":"#N/A"},{"$error":"#N/A"},{"$error":"#N/A"},{"$error":"#N/A"},{"$error":"#N/A"},null,null,{"$error":"#N/A"},null,{"$error":"#N/A"},{"$error":"#N/A"},0]
[{"$f":"IF(Inputs!B28=\"\",\"\",IF(units=2,CONVERT(Inputs!B28,\"ft\",\"m\"),Inputs!B28))","v":""},{"$f":"IF(Inputs!G28=\"\",\"\",IF(units=2,CONVERT(Inputs!G28,\"ft\",\"m\"),Inputs!G28))","v":""},{"$f":"IF(A22=\"\",\"\",IF(OR(A22<$B$3,Inputs!J28=\"No\"),\"Not_susc.\",\"Susceptible\"))","v":""},{"$f":"IF(OR(A22=\"\",Method_BI=FALSE),NA(),'PB Liquefaction Initiation'!F25)","v":{"$error":"#N/A"}},{"$f":"IF(OR(A22=\"\",Method_BI=FALSE),NA(),'Det Liquefaction Initiation'!T25)","v":{"$error":"#N/A"}},{"$f":"IF('PB Liquefaction Initiation'!P25=\"\",NA(),'Det Liquefaction Initiation'!S25)","v":{"$error":"#N/A"}},{"$error":"#N/A"},{"$error":"#N/A"},{"$error":"#N/A"},{"$error":"#N/A"},{"$error":"#N/A"},{"$error":"#N/A"},{"$error":"#N/A"},{"$error":"#N/A"},null,null,{"$error":"#N/A"},null,{"$error":"#N/A"},{"$error":"#N/A"},0]
[{"$f":"IF(Inputs!B29=\"\",\"\",IF(units=2,CONVERT(Inputs!B29,\"ft\",\"m\"),Inputs!B29))","v":""},{"$f":"IF(Inputs!G29=\"\",\"\",IF(units=2,CONVERT(Inputs!G29,\"ft\",\"m\"),Inputs!G29))","v":""},{"$f":"IF(A23=\"\",\"\",IF(OR(A23<$B$3,Inputs!J29=\"No\"),\"Not_susc.\",\"Susceptible\"))","v":""},{"$f":"IF(OR(A23=\"\",Method_BI=FALSE),NA(),'PB Liquefaction Initiation'!F26)","v":{"$error":"#N/A"}},{"$f":"IF(OR(A23=\"\",Method_BI=FALSE),NA(),'Det Liquefaction Initiation'!T26)","v":{"$error":"#N/A"}},{"$f":"IF('PB Liquefaction Initiation'!P26=\"\",NA(),'Det Liquefaction Initiation'!S26)","v":{"$error":"#N/A"}},{"$error":"#N/A"},{"$error":"#N/A"},{"$error":"#N/A"},{"$error":"#N/A"},{"$error":"#N/A"},{"$error":"#N/A"},{"$error":"#N/A"},{"$error":"#N/A"},null,null,{"$error":"#N/A"},null,{"$error":"#N/A"},{"$error":"#N/A"},0]
[{"$f":"IF(Inputs!B30=\"\",\"\",IF(units=2,CONVERT(Inputs!B30,\"ft\",\"m\"),Inputs!B30))","v":""},{"$f":"IF(Inputs!G30=\"\",\"\",IF(units=2,CONVERT(Inputs!G30,\"ft\",\"m\"),Inputs!G30))","v":""},{"$f":"IF(A24=\"\",\"\",IF(OR(A24<$B$3,Inputs!J30=\"No\"),\"Not_susc.\",\"Susceptible\"))","v":""},{"$f":"IF(OR(A24=\"\",Method_BI=FALSE),NA(),'PB Liquefaction Initiation'!F27)","v":{"$error":"#N/A"}},{"$f":"IF(OR(A24=\"\",Method_BI=FALSE),NA(),'Det Liquefaction Initiation'!T27)","v":{"$error":"#N/A"}},{"$f":"IF('PB Liquefaction Initiation'!P27=\"\",NA(),'Det Liquefaction Initiation'!S27)","v":{"$error":"#N/A"}},{"$error":"#N/A"},{"$error":"#N/A"},{"$error":"#N/A"},{"$error":"#N/A"},{"$error":"#N/A"},{"$error":"#N/A"},{"$error":"#N/A"},{"$error":"#N/A"},null,null,{"$error":"#N/A"},null,{"$error":"#N/A"},{"$error":"#N/A"},0]
[{"$f":"IF(Inputs!B31=\"\",\"\",IF(units=2,CONVERT(Inputs!B31,\"ft\",\"m\"),Inputs!B31))","v":""},{"$f":"IF(Inputs!G31=\"\",\"\",IF(units=2,CONVERT(Inputs!G31,\"ft\",\"m\"),Inputs!G31))","v":""},{"$f":"IF(A25=\"\",\"\",IF(OR(A25<$B$3,Inputs!J31=\"No\"),\"Not_susc.\",\"Susceptible\"))","v":""},{"$f":"IF(OR(A25=\"\",Method_BI=FALSE),NA(),'PB Liquefaction Initiation'!F28)","v":{"$error":"#N/A"}},{"$f":"IF(OR(A25=\"\",Method_BI=FALSE),NA(),'Det Liquefaction Initiation'!T28)","v":{"$error":"#N/A"}},{"$f":"IF('PB Liquefaction Initiation'!P28=\"\",NA(),'Det Liquefaction Initiation'!S28)","v":{"$error":"#N/A"}},{"$error":"#N/A"},{"$error":"#N/A"},{"$error":"#N/A"},{"$error":"#N/A"},{"$error":"#N/A"},{"$error":"#N/A"},{"$error":"#N/A"},{"$error":"#N/A"},null,null,{"$error":"#N/A"},null,{"$error":"#N/A"},{"$error":"#N/A"},0]
[{"$f":"IF(Inputs!B32=\"\",\"\",IF(units=2,CONVERT(Inputs!B32,\"ft\",\"m\"),Inputs!B32))","v":""},{"$f":"IF(Inputs!G32=\"\",\"\",IF(units=2,CONVERT(Inputs!G32,\"ft\",\"m\"),Inputs!G32))","v":""},{"$f":"IF(A26=\"\",\"\",IF(OR(A26<$B$3,Inputs!J32=\"No\"),\"Not_susc.\",\"Susceptible\"))","v":""},{"$f":"IF(OR(A26=\"\",Method_BI=FALSE),NA(),'PB Liquefaction Initiation'!F29)","v":{"$error":"#N/A"}},{"$f":"IF(OR(A26=\"\",Method_BI=FALSE),NA(),'Det Liquefaction Initiation'!T29)","v":{"$error":"#N/A"}},{"$f":"IF('PB Liquefaction Initiation'!P29=\"\",NA(),'Det Liquefaction Initiation'!S29)","v":{"$error":"#N/A"}},{"$error":"#N/A"},{"$error":"#N/A"},{"$error":"#N/A"},{"$error":"#N/A"},{"$error":"#N/A"},{"$error":"#N/A"},{"$error":"#N/A"},{"$error":"#N/A"},null,null,{"$error":"#N/A"},null,{"$error":"#N/A"},{"$error":"#N/A"},{"$f":"IF(OR(C26=\"\",C26=\"Not_susc.\"),0,T26)","v":0}]
[]
[]
["Simplified Performance-based Settlement using Cetin et al. (2009)"]
[]
[null,null,null,"Compute Deterministic Vertical Strain",null,null,null,null,null,null,null,"Compute Ground Surface Settlment",null,null,null,null,"Compute Settlement for Each Layer"]
["Depth (m)","Thickness (m)","Susceptible?","(N1)60,Cssite","CRR(Nreq)site","DR (%)site","εvsite",null,null,null,null,"DFi","ε*t*DFi","t*DFi","εv,eqv.site","Ssite (m)","εi*Dfi*Σti","Σ(ti*DFi)","εisite","Si (cm)","Ssite (cm)"]
[{"$f":"IF(Inputs!B13=\"\",\"\",IF(units=2,CONVERT(Inputs!B13,\"ft\",\"m\"),Inputs!B13))","v":0.4572},{"$f":"IF(Inputs!G13=\"\",\"\",IF(units=2,CONVERT(Inputs!G13,\"ft\",\"m\"),Inputs!G13))","v":0.91439999999999999},{"$f":"C7","v":"Susceptible"},{"$f":"IF(A33=\"\",NA(),'PB Liquefaction Initiation'!D43)","v":32.632000000000005},{"$f":"EXP(('Det Liquefaction Initiation'!K43-(29.06*LN(7.5))+15.25)/13.79)","v":0.44149015852727191},{"$f":"SQRT(D33/60)*100","v":73.747316335353304},{"$f":"MAX(0,((1.879*LN((780.416*LN(E33/(0.361*LN(F33)-0.579))-D33+2442.465)/(636.613*D33+306.732))+5.583)/100))","v":9.5195078363186341E-3},null,null,null,null,{"$f":"IF(A33=\"\",NA(),MAX(0,1-(A33/18)))","v":0.97460000000000002},{"$f":"G33*B33*L33","v":8.4835401612053038E-3},{"$f":"IF(OR(A33=\"\",C33=\"Not_susc.\"),NA(),B33*L33)","v":0.89117424000000001},{"$f":"SUMIFS(M33:M52,C33:C52,\"=Susceptible\",A33:A52,\"<18\")/SUMIFS(N33:N52,C33:C52,\"=Susceptible\",A33:A52,\"<18\")","v":2.7414618940097082E-2},{"$f":"1.15*O33*SUMIFS(B33:B52,C33:C52,\"=Susceptible\",A33:A52,\"<18\")","v":0.45164049485149299},{"$f":"G33*L33*SUMIFS($B$33:$B$52,$C$33:$C$52,\"=Susceptible\",$A$33:$A$52,\"<18\")","v":0.1329087958588831},{"$f":"SUMIF(C33:C52,\"=Susceptible\",N33:N52)","v":7.3681945600000001},{"$f":"Q33/$R$33","v":1.8038176757765079E-2},{"$f":"1.15*S33*B33*100","v":1.8968225151395444},{"$f":"SUMIF(C33:C52,\"=Susceptible\",T33:T52)","v":45.164049485149292}]
[{"$f":"IF(Inputs!B14=\"\",\"\",IF(units=2,CONVERT(Inputs!B14,\"ft\",\"m\"),Inputs!B14))","v":1.6763999999999999},{"$f":"IF(Inputs!G14=\"\",\"\",IF(units=2,CONVERT(Inputs!G14,\"ft\",\"m\"),Inputs!G14))","v":1.524},"Susceptible",{"$f":"IF(A34=\"\",NA(),'PB Liquefaction Initiation'!D44)","v":10.621491593382261},{"$f":"EXP(('Det Liquefaction Initiation'!K44-(29.06*LN(7.5))+15.25)/13.79)","v":0.63110622692422336},{"$f":"SQRT(D34/60)*100","v":42.074322322493131},3.4533768007194356E-2,null,null,null,null,0.90686666666666671,{"$f":"G34*B34*L34","v":4.7727905174109471E-2},1.3820648,null,null,{"$f":"G34*L34*SUMIFS($B$33:$B$52,$C$33:$C$52,\"=Susceptible\",$A$33:$A$52,\"<18\")","v":0.44864230863662907},null,6.0889042082600632E-2,10.671413515396585,{"$f":"IF(OR(C34=\"\",C34=\"Not_susc.\"),U35,U35+T34)","v":43.267226970009752}]
[{"$f":"IF(Inputs!B15=\"\",\"\",IF(units=2,CONVERT(Inputs!B15,\"ft\",\"m\"),Inputs!B15))","v":3.2004000000000001},{"$f":"IF(Inputs!G15=\"\",\"\",IF(units=2,CONVERT(Inputs!G15,\"ft\",\"m\"),Inputs!G15))","v":1.524},"Susceptible",{"$f":"IF(A35=\"\",NA(),'PB Liquefaction Initiation'!D45)","v":13.32533678800505},{"$f":"EXP(('Det Liquefaction Initiation'!K45-(29.06*LN(7.5))+15.25)/13.79)","v":0.75211169237553854},47.126313930409495,3.1197680058452585E-2,null,null,null,null,0.82220000000000004,{"$f":"G35*B35*L35","v":3.9091716397147008E-2},1.2530328000000002,null,null,0.36746213413318191,null,4.9871394022090253E-2,8.7404605163115363,32.595813454613165]
[{"$f":"IF(Inputs!B16=\"\",\"\",IF(units=2,CONVERT(Inputs!B16,\"ft\",\"m\"),Inputs!B16))","v":4.5720000000000001},{"$f":"IF(Inputs!G16=\"\",\"\",IF(units=2,CONVERT(Inputs!G16,\"ft\",\"m\"),Inputs!G16))","v":1.2192000000000001},"Not_susc.",{"$f":"IF(A36=\"\",NA(),'PB Liquefaction Initiation'!D46)","v":4.0320252341104634},{"$f":"EXP(('Det Liquefaction Initiation'!K46-(29.06*LN(7.5))+15.25)/13.79)","v":{"$error":"#N/A"}},25.92304391241656,{"$error":"#N/A"},null,null,null,null,0.746,{"$error":"#N/A"},{"$error":"#N/A"},null,null,{"$error":"#N/A"},null,{"$error":"#N/A"},{"$error":"#N/A"},23.855352938301628]
[{"$f":"IF(Inputs!B17=\"\",\"\",IF(units=2,CONVERT(Inputs!B17,\"ft\",\"m\"),Inputs!B17))","v":6.2484000000000002},{"$f":"IF(Inputs!G17=\"\",\"\",IF(units=2,CONVERT(Inputs!G17,\"ft\",\"m\"),Inputs!G17))","v":2.1335999999999999},"Susceptible",{"$f":"IF(A37=\"\",NA(),'PB Liquefaction Initiation'!D47)","v":22.247219944730496},{"$f":"EXP(('Det Liquefaction Initiation'!K47-(29.06*LN(7.5))+15.25)/13.79)","v":0.89690809312119368},60.892281865507528,2.2179479744729044E-2,null,null,null,null,0.65286666666666671,3.0895046484732309E-2,1.3929563200000001,null,null,0.20743816925463127,null,2.8153188351018689E-2,6.9077789065593489,23.855352938301628]
[{"$f":"IF(Inputs!B18=\"\",\"\",IF(units=2,CONVERT(Inputs!B18,\"ft\",\"m\"),Inputs!B18))","v":7.7724000000000002},{"$f":"IF(Inputs!G18=\"\",\"\",IF(units=2,CONVERT(Inputs!G18,\"ft\",\"m\"),Inputs!G18))","v":0.91439999999999999},"Susceptible",{"$f":"IF(A38=\"\",NA(),'PB Liquefaction Initiation'!D48)","v":30.426482551232123},{"$f":"EXP(('Det Liquefaction Initiation'!K48-(29.06*LN(7.5))+15.25)/13.79)","v":0.94736552497981241},71.211518908146829,1.6304109787637858E-2,null,null,null,null,0.56820000000000004,8.4709971938134836E-3,0.51956208000000004,null,null,0.13271228936974461,null,1.8011507200176947E-2,1.8940180511418068,16.947574031742281]
[{"$f":"IF(Inputs!B19=\"\",\"\",IF(units=2,CONVERT(Inputs!B19,\"ft\",\"m\"),Inputs!B19))","v":9.2964000000000002},{"$f":"IF(Inputs!G19=\"\",\"\",IF(units=2,CONVERT(Inputs!G19,\"ft\",\"m\"),Inputs!G19))","v":2.1335999999999999},"Susceptible",{"$f":"IF(A39=\"\",NA(),'PB Liquefaction Initiation'!D49)","v":20.884133717749325},{"$f":"EXP(('Det Liquefaction Initiation'!K49-(29.06*LN(7.5))+15.25)/13.79)","v":0.98900288046330997},58.997363949232685,2.401105049186987E-2,null,null,null,null,0.48353333333333337,2.4771401704701775E-2,1.03166672,null,null,0.16632226858871196,null,2.2573001735273393E-2,5.5386019977736201,15.053555980600473]
[{"$f":"IF(Inputs!B20=\"\",\"\",IF(units=2,CONVERT(Inputs!B20,\"ft\",\"m\"),Inputs!B20))","v":10.820399999999999},{"$f":"IF(Inputs!G20=\"\",\"\",IF(units=2,CONVERT(Inputs!G20,\"ft\",\"m\"),Inputs!G20))","v":0.91439999999999999},"Susceptible",{"$f":"IF(A40=\"\",NA(),'PB Liquefaction Initiation'!D50)","v":9.1514758932516074},{"$f":"EXP(('Det Liquefaction Initiation'!K50-(29.06*LN(7.5))+15.25)/13.79)","v":1.0237192437790503},39.054397731991735,4.0291732137888496E-2,null,null,null,null,0.3988666666666667,1.469534881890496E-2,0.36472368000000005,null,null,0.23022713149617777,null,3.124607115371527E-2,3.2857118582400826,9.514953982826853]
[{"$f":"IF(Inputs!B21=\"\",\"\",IF(units=2,CONVERT(Inputs!B21,\"ft\",\"m\"),Inputs!B21))","v":12.4968},{"$f":"IF(Inputs!G21=\"\",\"\",IF(units=2,CONVERT(Inputs!G21,\"ft\",\"m\"),Inputs!G21))","v":2.4384000000000001},"Not_susc.",{"$f":"IF(A41=\"\",NA(),'PB Liquefaction Initiation'!D51)","v":4.144728715335928},{"$f":"EXP(('Det Liquefaction Initiation'!K51-(29.06*LN(7.5))+15.25)/13.79)","v":{"$error":"#N/A"}},26.282848384881248,{"$error":"#N/A"},null,null,null,null,0.3057333333333333,{"$error":"#N/A"},{"$error":"#N/A"},null,null,{"$error":"#N/A"},null,{"$error":"#N/A"},{"$error":"#N/A"},6.2292421245867713]
[{"$f":"IF(Inputs!B22=\"\",\"\",IF(units=2,CONVERT(Inputs!B22,\"ft\",\"m\"),Inputs!B22))","v":13.715999999999999},{"$f":"IF(Inputs!G22=\"\",\"\",IF(units=2,CONVERT(Inputs!G22,\"ft\",\"m\"),Inputs!G22))","v":0.91439999999999999},"Susceptible",{"$f":"IF(A42=\"\",NA(),'PB Liquefaction Initiation'!D52)","v":2.0632593460236448},{"$f":"EXP(('Det Liquefaction Initiation'!K52-(29.06*LN(7.5))+15.25)/13.79)","v":1.074351126626564},18.543908910221909,6.7882049552498588E-2,null,null,null,null,0.23799999999999999,1.477298037437152E-2,0.21762719999999999,null,null,0.23144335919848716,null,3.141113570140134E-2,3.3030693858165585,6.2292421245867713]
[{"$f":"IF(Inputs!B23=\"\",\"\",IF(units=2,CONVERT(Inputs!B23,\"ft\",\"m\"),Inputs!B23))","v":15.6972},{"$f":"IF(Inputs!G23=\"\",\"\",IF(units=2,CONVERT(Inputs!G23,\"ft\",\"m\"),Inputs!G23))","v":2.1335999999999999},"Susceptible",{"$f":"IF(A43=\"\",NA(),'PB Liquefaction Initiation'!D53)","v":10.322847584760181},{"$f":"EXP(('Det Liquefaction Initiation'!K53-(29.06*LN(7.5))+15.25)/13.79)","v":1.0991366765650474},41.47860409247194,3.8357162904326822E-2,null,null,null,null,0.12793333333333334,1.0469915952050468E-2,0.27295856000000002,null,null,7.029800710662458E-2,null,9.5407370875158562E-3,2.3409534147412403,2.9261727387702128]
[{"$f":"IF(Inputs!B24=\"\",\"\",IF(units=2,CONVERT(Inputs!B24,\"ft\",\"m\"),Inputs!B24))","v":17.3736},{"$f":"IF(Inputs!G24=\"\",\"\",IF(units=2,CONVERT(Inputs!G24,\"ft\",\"m\"),Inputs!G24))","v":1.2192000000000001},"Susceptible",{"$f":"IF(A44=\"\",NA(),'PB Liquefaction Initiation'!D54)","v":2.9720420997108414},{"$f":"EXP(('Det Liquefaction Initiation'!K54-(29.06*LN(7.5))+15.25)/13.79)","v":1.1145069273285872},22.256242943313836,6.1690016202917433E-2,null,null,null,null,3.4800000000000053E-2,2.6173938778599774E-3,4.2428160000000069E-2,null,null,3.0754378064854739E-2,null,4.1739367513192729E-3,0.58521932402897259,0.58521932402897259]
[{"$f":"IF(Inputs!B25=\"\",\"\",IF(units=2,CONVERT(Inputs!B25,\"ft\",\"m\"),Inputs!B25))","v":""},{"$f":"IF(Inputs!G25=\"\",\"\",IF(units=2,CONVERT(Inputs!G25,\"ft\",\"m\"),Inputs!G25))","v":""},"",{"$f":"IF(A45=\"\",NA(),'PB Liquefaction Initiation'!D55)","v":{"$error":"#N/A"}},{"$f":"EXP(('Det Liquefaction Initiation'!K55-(29.06*LN(7.5))+15.25)/13.79)","v":{"$error":"#N/A"}},{"$error":"#N/A"},{"$error":"#N/A"},null,null,null,null,{"$error":"#N/A"},{"$error":"#N/A"},{"$error":"#N/A"},null,null,{"$error":"#N/A"},null,{"$error":"#N/A"},{"$error":"#N/A"},0]
[{"$f":"IF(Inputs!B26=\"\",\"\",IF(units=2,CONVERT(Inputs!B26,\"ft\",\"m\"),Inputs!B26))","v":""},{"$f":"IF(Inputs!G26=\"\",\"\",IF(units=2,CONVERT(Inputs!G26,\"ft\",\"m\"),Inputs!G26))","v":""},"",{"$f":"IF(A46=\"\",NA(),'PB Liquefaction Initiation'!D56)","v":{"$error":"#N/A"}},{"$f":"EXP(('Det Liquefaction Initiation'!K56-(29.06*LN(7.5))+15.25)/13.79)","v":{"$error":"#N/A"}},{"$error":"#N/A"},{"$error":"#N/A"},null,null,null,null,{"$error":"#N/A"},{"$error":"#N/A"},{"$error":"#N/A"},null,null,{"$error":"#N/A"},null,{"$error":"#N/A"},{"$error":"#N/A"},0]
[{"$f":"IF(Inputs!B27=\"\",\"\",IF(units=2,CONVERT(Inputs!B27,\"ft\",\"m\"),Inputs!B27))","v":""},{"$f":"IF(Inputs!G27=\"\",\"\",IF(units=2,CONVERT(Inputs!G27,\"ft\",\"m\"),Inputs!G27))","v":""},"",{"$f":"IF(A47=\"\",NA(),'PB Liquefaction Initiation'!D57)","v":{"$error":"#N/A"}},{"$f":"EXP(('Det Liquefaction Initiation'!K57-(29.06*LN(7.5))+15.25)/13.79)","v":{"$error":"#N/A"}},{"$error":"#N/A"},{"$error":"#N/A"},null,null,null,null,{"$error":"#N/A"},{"$error":"#N/A"},{"$error":"#N/A"},null,null,{"$error":"#N/A"},null,{"$error":"#N/A"},{"$error":"#N/A"},0]
[{"$f":"IF(Inputs!B28=\"\",\"\",IF(units=2,CONVERT(Inputs!B28,\"ft\",\"m\"),Inputs!B28))","v":""},{"$f":"IF(Inputs!G28=\"\",\"\",IF(units=2,CONVERT(Inputs!G28,\"ft\",\"m\"),Inputs!G28))","v":""},"",{"$f":"IF(A48=\"\",NA(),'PB Liquefaction Initiation'!D58)","v":{"$error":"#N/A"}},{"$f":"EXP(('Det Liquefaction Initiation'!K58-(29.06*LN(7.5))+15.25)/13.79)","v":{"$error":"#N/A"}},{"$error":"#N/A"},{"$error":"#N/A"},null,null,null,null,{"$error":"#N/A"},{"$error":"#N/A"},{"$error":"#N/A"},null,null,{"$error":"#N/A"},null,{"$error":"#N/A"},{"$error":"#N/A"},0]
[{"$f":"IF(Inputs!B29=\"\",\"\",IF(units=2,CONVERT(Inputs!B29,\"ft\",\"m\"),Inputs!B29))","v":""},{"$f":"IF(Inputs!G29=\"\",\"\",IF(units=2,CONVERT(Inputs!G29,\"ft\",\"m\"),Inputs!G29))","v":""},"",{"$f":"IF(A49=\"\",NA(),'PB Liquefaction Initiation'!D59)","v":{"$error":"#N/A"}},{"$f":"EXP(('Det Liquefaction Initiation'!K59-(29.06*LN(7.5))+15.25)/13.79)","v":{"$error":"#N/A"}},{"$error":"#N/A"},{"$error":"#N/A"},null,null,null,null,{"$error":"#N/A"},{"$error":"#N/A"},{"$error":"#N/A"},null,null,{"$error":"#N/A"},null,{"$error":"#N/A"},{"$error":"#N/A"},0]
[{"$f":"IF(Inputs!B30=\"\",\"\",IF(units=2,CONVERT(Inputs!B30,\"ft\",\"m\"),Inputs!B30))","v":""},{"$f":"IF(Inputs!G30=\"\",\"\",IF(units=2,CONVERT(Inputs!G30,\"ft\",\"m\"),Inputs!G30))","v":""},"",{"$f":"IF(A50=\"\",NA(),'PB Liquefaction Initiation'!D60)","v":{"$error":"#N/A"}},{"$f":"EXP(('Det Liquefaction Initiation'!K60-(29.06*LN(7.5))+15.25)/13.79)","v":{"$error":"#N/A"}},{"$error":"#N/A"},{"$error":"#N/A"},null,null,null,null,{"$error":"#N/A"},{"$error":"#N/A"},{"$error":"#N/A"},null,null,{"$error":"#N/A"},null,{"$error":"#N/A"},{"$error":"#N/A"},0]
[{"$f":"IF(Inputs!B31=\"\",\"\",IF(units=2,CONVERT(Inputs!B31,\"ft\",\"m\"),Inputs!B31))","v":""},{"$f":"IF(Inputs!G31=\"\",\"\",IF(units=2,CONVERT(Inputs!G31,\"ft\",\"m\"),Inputs!G31))","v":""},"",{"$f":"IF(A51=\"\",NA(),'PB Liquefaction Initiation'!D61)","v":{"$error":"#N/A"}},{"$f":"EXP(('Det Liquefaction Initiation'!K61-(29.06*LN(7.5))+15.25)/13.79)","v":{"$error":"#N/A"}},{"$error":"#N/A"},{"$error":"#N/A"},null,null,null,null,{"$error":"#N/A"},{"$error":"#N/A"},{"$error":"#N/A"},null,null,{"$error":"#N/A"},null,{"$error":"#N/A"},{"$error":"#N/A"},0]
[{"$f":"IF(Inputs!B32=\"\",\"\",IF(units=2,CONVERT(Inputs!B32,\"ft\",\"m\"),Inputs!B32))","v":""},{"$f":"IF(Inputs!G32=\"\",\"\",IF(units=2,CONVERT(Inputs!G32,\"ft\",\"m\"),Inputs!G32))","v":""},"",{"$f":"IF(A52=\"\",NA(),'PB Liquefaction Initiation'!D62)","v":{"$error":"#N/A"}},{"$f":"EXP(('Det Liquefaction Initiation'!K62-(29.06*LN(7.5))+15.25)/13.79)","v":{"$error":"#N/A"}},{"$error":"#N/A"},{"$error":"#N/A"},null,null,null,null,{"$error":"#N/A"},{"$error":"#N/A"},{"$error":"#N/A"},null,null,{"$error":"#N/A"},null,{"$error":"#N/A"},{"$error":"#N/A"},{"$f":"IF(OR(C52=\"\",C52=\"Not_susc.\"),0,T52)","v":0}]

{"sheet":"Lateral Spread","index":8,"n_rows":25,"n_cols":17,"rows_kept":25,"cut":false,"hidden":false,"merged":[[23,5,23,6],[22,1,22,3],[22,5,22,7],[2,1,2,4],[2,14,2,16],[11,1,11,2],[12,1,12,2],[14,1,14,4],[16,1,16,2],[15,1,15,2],[17,1,17,2]]}
[null,"Inputs"]
[null,null,null,null,null,null,"Original Model"]
[null,"Simplified Method",null,null,null,null,null,null,null,null,null,null,null,null,"Regression Coefficients"]
[null,"Case:  Free Face / Ground Slope",null,null,null,null,null,null,null,null,null,null,null,null,null,"GS","FF"]
[null,"S =",{"$f":"IF(S_prob=\"\",\"\",S_prob)","v":1.5},"%",null,null,null,null,null,null,null,null,null,null,"b0",-16.213000000000001,-16.713000000000001]
[null,"W =",{"$f":"IF(W_prob=\"\",\"\",W_prob)","v":16},"%",null,null,null,null,null,null,null,null,null,null,"b1",1.532,1.532]
[null,"T15 =",{"$f":"IF(T15_prob=\"\",\"\",IF(units=2,CONVERT(T15_prob,\"ft\",\"m\"),T15_prob))","v":3.048},"m",null,null,null,null,null,null,null,null,null,null,"b2",-1.4059999999999999,-1.4059999999999999]
[null,"F15 =",{"$f":"IF(F15_prob=\"\",\"\",F15_prob)","v":11},"%",null,null,null,null,null,null,null,null,null,null,"b3",-1.2E-2,-1.2E-2]
[null,"D5015 =",{"$f":"IF(D50_prob=\"\",\"\",D50_prob)","v":5},"mm",null,null,null,null,null,null,null,null,null,null,"b4",0,0.59199999999999997]
[null,null,null,null,null,null,null,null,null,null,null,null,null,null,"b5",0.33800000000000002,0]
[null,"Mapped Value:",null,null,null,null,null,null,null,null,null,null,null,null,"b6",0.54,0.54]
[null,"Log Dhref =",null,{"$f":"IF(Dh_ref=\"\",\"\",Dh_ref)","v":0.55000000000000004},"m",null,"Simplified Method",null,null,null,null,null,null,null,"b7",3.4129999999999998,3.4129999999999998]
[null,"Return Period =",null,{"$f":"IF(Inputs!G51=\"\",\"\",Inputs!G51)","v":""},null,null,null,null,null,null,null,null,null,null,"b8",-0.79500000000000004,-0.79500000000000004]
[]
[null,"Deterministic Method"]
[null,"R =",null,{"$f":"IF(OR(R_LS_det=\"\", Det_LS_option=FALSE),\"\",R_LS_det)","v":1.1100000000000001},"km"]
[null,"M =",null,{"$f":"IF(OR(Mw_LS_det=\"\",Det_LS_option=FALSE),\"\",Mw_LS_det)","v":7}]
[null,"Percentile =",null,{"$f":"IF(OR(Percentile_LS=\"\",Det_LS_option=FALSE),\"\",Percentile_LS)","v":85}]
[]
[]
[]
[]
[null,"Simplified Model Results",null,null,null,"Deterministic Results"]
[null,"ΔDh =",{"$f":"IF(D12=\"\",\"\",9.043+IF(LS_GS_Opt=\"GS\",P5,Q5)+IF(LS_GS_Opt=\"GS\",P9,Q9)*LOG(C6+0.0000001)+IF(LS_GS_Opt=\"GS\",P10,Q10)*LOG(C5+0.000001)+0.54*LOG(C7)+3.413*LOG(100-C8)-0.795*LOG(C9+0.1))","v":-0.75836317405647968},null,null,"Percentile =",null,{"$f":"IF(D18=\"\",\"\",D18)","v":85}]
[null," Dhsite =",{"$f":"IF(C24=\"\",\"\",10^(D12+C24))","v":0.61892329071311147},"m",null,"Dh =",{"$f":"IF(OR(H24=\"\",Det_LS_option=FALSE),\"\",10^((IF(LS_GS_Opt=\"GS\",P5,Q5)+P6*D17+P7*LOG(D16+10^(0.89*D17-5.64))+P8*D16+IF(LS_GS_Opt=\"GS\",P9,Q9)*LOG(C6+0.0000001)+IF(LS_GS_Opt=\"GS\",P10,Q10)*LOG(C5+0.00002)+P11*LOG(C7)+P12*LOG(100-C8)+P13*LOG(C9+0.1))+_xlfn.NORM.S.INV(H24/100)*0.197))","v":1.3511050172632262},"m"]

{"sheet":"Slope Displacement","index":9,"n_rows":60,"n_cols":9,"rows_kept":60,"cut":false,"hidden":false,"merged":[[58,5,58,6],[2,1,2,3],[26,1,26,3],[26,5,26,7],[27,5,27,6],[33,1,33,3],[57,1,57,3],[57,5,57,7]]}
["Simplified Performance-based Seismic Slope Displacement Rathje & Saygili (2009)"]
[]
[null,"Simplified Method"]
[null,"Input site information",null,null,null,null,"Original Model"]
[]
[null,"kysite",{"$f":"IF(ky_site=\"\",\"\",ky_site)","v":0.2}]
[null,"FPGAsite",{"$f":"IF(Fpga=\"\",\"\",Fpga)","v":1.06}]
[null,"PGA",{"$f":"IF(PGA_prob=\"\",\"\",PGA_prob)","v":0.44}]
[null,"Mw",{"$f":"IF(Mw_prob=\"\",\"\",Mw_prob)","v":6.77}]
[]
[null,"Input reference information"]
[null,"kyref",0.1]
[null,"FPGAref",1]
[null,"Dref",{"$f":"IF(D_ref_RS=\"\",\"\",D_ref_RS)","v":2.4300000000000002}]
[]
[null,"Deterministic Method",null,null,null,null,"Simplified Model"]
[null,"Input  information"]
[]
[null,"ky",{"$f":"IF(ky_site=\"\",\"\",ky_site)","v":0.2}]
[null,"PGA",{"$f":"IF(PGA_det=\"\",\"\",PGA_det)","v":0.73}]
[null,"Mw",{"$f":"IF(Mw_det=\"\",\"\",Mw_det)","v":6.8}]
[null,"Percentile",{"$f":"IF(Percentile_Slope=\"\",\"\",Percentile_Slope)","v":85}]
[]
[]
[]
[]
[null,"Simplified Model Results",null,null,null,"Deterministic Results"]
[null,"ΔlnD =",{"$f":"IF(AND(C8<0.1,C6<0.17),\" \",IF(C12=\" \",\" \",4.85/$C$8*($C$12/Fpga_ref_SS-$C$6/$C$7)+19.64/($C$8)^2*(($C$12/Fpga_ref_SS)^2-($C$6/$C$7)^2)+42.49/($C$8)^3*(($C$6/$C$7)^3-($C$12/Fpga_ref_SS)^3)+29.06/($C$8)^4*(($C$12/Fpga_ref_SS)^4-($C$6/$C$7)^4)+0.79*LN($C$7/Fpga_ref_SS)))","v":-1.5819112973086147},null,null,"Percentile =",null,{"$f":"C22","v":85},{"$f":"_xlfn.NORM.S.INV(H28/100)","v":1.0364333894937898}]
[null," Dsite =",{"$f":"IF(AND(C8<=0.1,C6<=0.17),\" \",IF($C$14=\"  \",\"  \",$C$14*EXP($C$28)))","v":0.49956376071736924},"cm",null,"Dh =",{"$f":"EXP(4.89-4.85*($C$19/$C$20)-19.64*($C$19/$C$20)^2+42.49*($C$19/$C$20)^3-29.06*($C$19/$C$20)^4+0.72*LN($C$20)+0.89*($C$21-6)+I28*(0.732+0.789*(C19/C20)-0.539*(C19/C20)^2))","v":68.2573000239789},"cm"]
[]
[]
["Simplified Performance-based Seismic Slope Displacement Bray and Travasarou (2007)"]
[]
[null,"Simplified Method"]
[null,"Input site information",null,null,null,null,"Original Model"]
[]
[null,"kysite",{"$f":"IF(ky_site=\"\",\"\",ky_site)","v":0.2}]
[null,"FPGAsite",{"$f":"IF(Fpga=\"\",\"\",Fpga)","v":1.06}]
[null,"PGA",{"$f":"IF(PGA_prob=\"\",\"\",PGA_prob)","v":0.44}]
[null,"Mw",{"$f":"IF(Mw_prob=\"\",\"\",Mw_prob)","v":6.77}]
[]
[null,"Input reference information"]
[null,"kyref",0.1]
[null,"FPGAref",1]
[null,"Dref",{"$f":"IF(D_ref_BT=\"\",\"\",D_ref_BT)","v":2.65}]
[]
[null,"Deterministic Method",null,null,null,null,"Simplified Model"]
[null,"Input  information"]
[]
[null,"ky",{"$f":"IF(ky_site=\"\",\"\",ky_site)","v":0.2}]
[null,"PGA",{"$f":"IF(PGA_det=\"\",\"\",PGA_det)","v":0.73}]
[null,"Mw",{"$f":"IF(Mw_det=\"\",\"\",Mw_det)","v":6.8}]
[null,"Percentile",{"$f":"IF(Percentile_Slope=\"\",\"\",Percentile_Slope)","v":85}]
[]
[]
[]
[]
[null,"Simplified Model Results",null,null,null,"Deterministic Results"]
[null,"ΔlnD =",{"$f":"IF(C45=\" \",\" \",2.83*(LN($C$43/$C$44)-LN($C$37/$C$38))+0.333*(LN($C$43/$C$44)^2-LN($C$37/$C$38)^2)+0.566*LN($C$39)*(LN($C$43/$C$44)-LN($C$37/$C$38)))","v":-0.66231631483883291},null,null,"Percentile =",null,{"$f":"C53","v":85},{"$f":"_xlfn.NORM.S.INV(H59/100)","v":1.0364333894937898}]
[null," Dsite =",{"$f":"IF(C59=\" \",\" \",C45*EXP(C59))","v":1.3664871532841187},"cm",null,"Dh =",{"$f":"EXP(-0.22-2.83*LN($C$50)-0.333*(LN($C$50))^2+0.566*LN($C$50)*LN($C$51)+3.04*LN($C$51)-0.244*(LN($C$51))^2+0.278*($C$52-7)+I59*0.67)","v":30.470196206295391},"cm"]

{"sheet":"References","index":10,"n_rows":165,"n_cols":34,"rows_kept":165,"cut":false,"hidden":false,"merged":[[38,2,38,6],[39,1,39,6],[25,1,25,2],[21,3,21,4],[21,1,22,2],[23,1,23,2],[24,1,24,2],[31,1,32,1],[31,2,31,6]]}
["Liquefaction Initiation / Settlement",null,null,null,null,null,null,null,null,null,null,null,null,null,null,null,null,null,null,"Lateral Spread Displacement",null,null,null,null,null,null,null,null,null,null,null,null,null,"Seismic Slope Displacement"]
[]
[null,null,null,null,null,null,null,null,null,null,null,null,null,null,null,null,null,null,null,null,null,null,null,null,null,null,null,null,null,null,null,null,null,"Seismic Slope Displacement Parameters for both Rathje & Saygili (2009) and Bray & Travasarou (2007):"]
["Liquefaction Initiation Parameters (Performance-Based):",null,null,null,null,null,null,null,null,null,null,null,null,null,null,null,null,null,null,"Lateral Spread Parameters (Youd et al 2002 Model):"]
[]
[]
[]
[]
[]
[]
[]
[]
[null,null,null,null,null,null,null,null,null,null,null,null,null,null,null,null,null,null,null,null,null,null,null,null,null,null,null,null,null,null,null,null,null,"Infinite Slope Conditions to calculate ky (Rathje and Saygili, 2009):"]
[null,null,null,null,null,null,null,null,null,null,null,null,null,null,null,null,null,null,null,"Site Geometry:"]
[]
[]
[]
[]
[]
["Convert between Return Period and Exceedance Probability:"]
[]
[null,"Return Period",null,"Exceedance Probability"]
[null,null,null,"Percent","Years"]
[null,475,null,10,50]
[null,"1,039 (1,033)",null,"2 (7)","21 (75)"]
[null,2475,null,2,50]
[]
[]
["Site Amplification Factors (Fpga):"]
["*For Site Class definitions, see below",null,null,null,null,null,null,null,null,null,null,null,null,null,null,null,null,null,null,null,null,null,null,null,null,null,null,null,null,null,null,null,null,"Warning when computing ky values(only applicable for the Rathje and Saygili 2009 method):"]
[]
[null,"Site Class","Site Amplification Factor, Fpga"]
[null,null,"PGA(g)<0.10","PGA(g)=0.20","PGA(g)=0.30","PGA(g)=0.40","PGA(g)>0.50",null,null,null,null,null,null,null,null,null,null,null,null,"Recommended range of parameter values:"]
[null,"A",0.8,0.8,0.8,0.8,0.8]
[null,"B",1,1,1,1,1]
[null,"C",1.2,1.2,1.1000000000000001,1,1]
[null,"D",1.6,1.4,1.2,1.1000000000000001,1]
[null,"E",2.5,1.7,1.2,0.9,0.9]
[null,"F","Site Response Analysis Required"]
[null,"*For intermediate PGA values, interpolate linearly ",null,null,null,null,null,null,null,null,null,null,null,null,null,null,null,null,null,null,null,null,null,null,null,null,null,null,null,null,null,null,null,"Technical References:"]
[]
["Site Class Definitions:"]
["From AASHTO LRFD Bridge Design Specifications (2007):"]
[]
[]
[]
[]
[]
[]
[]
[]
[null,null,null,null,null,null,null,null,null,null,null,null,null,null,null,null,null,null,null,"Source to Site Distance:"]
[]
[null,null,null,null,null,null,null,null,null,null,null,null,null,null,null,null,null,null,null,"R is the nearest horizontal map distance from the site to the seismic energy source. "]
[null,null,null,null,null,null,null,null,null,null,null,null,null,null,null,null,null,null,null,"This is the same as the Boore-Joyner distance (RJB) as can be seen in the following figure"]
[]
[]
[]
[]
[]
[]
[]
[]
[]
[]
[]
[]
[]
[]
[]
[]
[null,null,null,null,null,null,null,null,null,null,null,null,null,null,null,null,null,null,null,"Technical References:"]
[]
[]
[]
[]
[]
[]
[]
[]
[]
[]
[]
[]
[]
[null,null,null,null,null,null,null,null,null,null,null,null,null,null,null,null,null,null,null,"Correct SPT N for Non-Standard Sampler Sizes (default relationship is LaCroix and Horn):"]
[]
[]
[]
[]
[]
[]
[]
[]
[]
[]
[]
[]
[]
[]
[]
[]
[]
[]
[]
[]
["How to Turn on Iterative Calculations:"]
[]
[]
[]
[]
[]
[]
[]
[]
[]
[]
[]
[]
[]
[]
[]
[]
[]
[]
[]
[]
[]
[]
[]
[]
[]
[]
[]
[]
[]
[]
[]
[]
[]
[]
[]
[]
[]
[]
[]
[]
[]
[]
[]
[]
[]
[]
[]
[]
[]
[]
[]
[]
[]
[]
[]
[]
[]
["Technical References:"]

{"sheet":"Version Notes","index":11,"n_rows":37,"n_cols":3,"rows_kept":37,"cut":false,"hidden":false,"merged":[]}
["Version","Date","Change"]
["BETA1.91",null,"Added a \"Version Notes\" Sheet"]
[null,null,"Changed how C_sigma is calculated on the \"Det Liquefaction Initiation\" Sheet; C_sigma is now calculated from (N1)60cs"]
[]
["BETA1.92",null,"Removed settlement-specific analysis selections on \"Inputs\" sheet. Settlement will now automatically compute and display when Liquefaction Initiation is computed"]
[null,null,"\"Site Liquefaction/Slope Disp. Parameters\" section on \"Inputs\" sheet renamed to \"Ground Motion Parameters\""]
[null,null,"MSF (2014 or 2012) analysis selection relocated to \"Ground Motion Parameters\" section on \"Inputs\" sheet."]
[null,null,"Adjusted several comment hover box sizes so that entire comment could be read. Some comment boxes were too small."]
[null,null,"Removed ky input on \"Deterministic Analysis Parametes\" section on the \"Inputs\" sheet. Ky now only needs to be input once on the \"Inputs\" sheet."]
[null,null,"Added clarifying comment that M_w is the MEAN magnitude when input into \"Ground Motion Parameters\" section on \"Inputs\" sheet"]
["1.0",null,"Removed BETA tag."]
[1.1000000000000001,null,"Fixed Formula Error in calculating DETERMINISTIC CRR in Det Liquefaction Initiation"]
[null,null,"Fixed Formula Error in calculating equivalent strains for liquefaction settlement"]
[null,null,"Removed Interpolation tool, Reference Hazard Values are now obtained through online database."]
["1.1.01",null,"Fixed minor formatting issues; locked some cells making them unavailable for changes"]
[null,null,"Fixed drop down box that allows for selection of return period"]
[1.2,"2017-07-17","Added instructions on \"Inputs\" tab on how to access updated USGS deaggregation data"]
[null,null,"Fixed a bug where T15 could not be changed for lateral spread analyses"]
[null,null,"Updated hyperlink that allows users to access online reference parameter maps by clicking on blue button"]
[null,null,"Fixed a simplified performance-based seismic slope displacement calculation for Rathje and Saygili model"]
[null,null,"Vs,12 input cell is now grayed out if Cetin triggering model is set to \"FALSE\""]
[null,null,"Fixed a bug that displayed \"#REF!\" on the Seismic slope Inputs for Deterministic Analysis on the Final Summary Tab."]
[null,null,"Made the depth scale on settlment plots on \"Final Summary Tab\" to the same scale as other plots"]
[null,null,"Fixed equation in PB Settlement to multiply approximate site strains by Probability of Liquefaction"]
[1.21,"2017-11-01","Fixed a bug that would not allow the geometry type to be changed for lateral spread displacement assessment"]
[1.3,"2018-01-29","Fixed a bug in how ground surface settlements were calculated in both PB Settlement and Det Settlement tab"]
[null,null,"Updated the hyperlink for the Reference Map Database button on the \"Inputs\" tab"]
[1.4,"2018-09-05","Updated hyperlink for the Reference Map Database."]
[null,null,"Provide Cells on Inputs tab that allows for conversion to Standard SPT from Non-standard sampler sizes. "]
[null,null,"Included a Water Table at time of drilling, and Design Ground Water Depth"]
[1.41,"2019-01-28","Added clarifying comment in the \"Sampler Type\" column on the \"Inputs\" tab."]
[null,null,"Renamed cell title for cell L23 to \"Liner Type\""]
[null,null,"Adjusted note 2 by the \"Reference Map Database\" button."]
[null,null,"Added Sampler type column to \"Final Summary\" tab."]
[null,null,"Changed the units type to reflect meters instead of feet when SI units are selected."]
[1.42,"2021-11-17","Updated the hyperlink for the Reference Map Database button on the \"Inputs\" tab; removed Hidden worksheet; adjusted default zoom on Input and Final Summary Sheets"]
[1.43,"2022-07-28","Updated a bug on the units for Vs12 in Final Summary tab. It was hard-coded to be m/s; Also expanded data validation limits for Fpga to be from 0.5-3.0 to 0.1-4.0."]

{"sheet":"_Hidden","index":12,"n_rows":61,"n_cols":35,"rows_kept":61,"cut":false,"hidden":true,"merged":[[3,29,3,34],[3,3,4,3],[3,5,3,10],[3,11,3,16],[3,21,4,21],[3,23,3,28]]}
["Units",null,null,"Simplified PB",null,null,null,null,null,null,null,null,null,null,null,null,null,null,null,null,null,"Deterministic"]
[1,null,null,"(Step-wise Plot)",null,null,null,null,null,null,null,null,null,null,null,null,null,null,null,null,null,"(Step-wise Plot)"]
[2]
[null,null,null,{"$f":"IF(units=1,\"Thickness (m)\",\"Thickness (ft)\")","v":"Thickness (ft)"},null,"Idriss and Boulanger (2008, 2012)",null,null,null,null,null,"Cetin et al. (2004)",null,null,null,null,null,null,"P_L 50% line:",null,null,{"$f":"IF(units=1,\"Thickness (m)\",\"Thickness (ft)\")","v":"Thickness (ft)"},null,"Idriss and Boulanger (2008, 2012)",null,null,null,null,null,"Cetin et al. (2004)"]
["FPGA",null,null,null,{"$f":"IF(units=1,\"Depth (m)\",\"Depth (ft)\")","v":"Depth (ft)"},"(N1)60,cs","Nreqsite","CSRsite","P_L/FS_L","CRR","Settle","(N1)60,cs","Nreqsite","CSRsite","P_L/FS_L","CRR","Settle",null,"Depth","P_L",null,null,{"$f":"IF(units=1,\"Depth (m)\",\"Depth (ft)\")","v":"Depth (ft)"},"(N1)60,cs","Nreqsite","CSRsite","P_L/FS_L","CRR","Settle","(N1)60,cs","Nreqsite","CSRsite","P_L/FS_L","CRR","Settle"]
["A",null,null,{"$f":"IF(Inputs!$G13=\"\",NA(),Inputs!$G13)","v":3},0,{"$f":"'Final Summary'!K26","v":33.874185446686866},{"$f":"'Final Summary'!L26","v":19.147705078125},{"$f":"'Final Summary'!M26","v":0.22311236023806372},{"$f":"'Final Summary'!N26","v":4.531038012233954},{"$f":"'PB Liquefaction Initiation'!Q10","v":1.010930585237902},null,{"$f":"'Final Summary'!P26","v":32.632000000000005},{"$f":"'Final Summary'!Q26","v":42.004928699970996},{"$f":"'Final Summary'!R26","v":2.6853170884224604},{"$f":"'Final Summary'!S26","v":0.5067739356819696},{"$f":"'PB Liquefaction Initiation'!N43","v":1.3608487094538979},null,null,0,0.5,null,{"$f":"IF(Inputs!$G13=\"\",NA(),Inputs!$G13)","v":3},0,{"$f":"'Final Summary'!V26","v":33.874185446686866},{"$f":"'Final Summary'!W26","v":30.872833251953125},{"$f":"'Final Summary'!X26","v":0.41396383811397325},{"$f":"'Final Summary'!Y26","v":1.8540697745700523},{"$f":"'Det Liquefaction Initiation'!T10","v":0.76751784001212797},null,{"$f":"'Final Summary'!AA26","v":32.632000000000005},{"$f":"'Final Summary'!AB26","v":32.02838398000322},{"$f":"'Final Summary'!AC26","v":0.95265995669352044},{"$f":"'Final Summary'!AD26","v":1.6810605542142403},{"$f":"'Det Liquefaction Initiation'!O43","v":1.6014790747769236}]
["B",null,null,null,{"$f":"D6+E6","v":3},{"$f":"F6","v":33.874185446686866},{"$f":"G6","v":19.147705078125},0.22311236023806372,4.531038012233954,1.010930585237902,null,32.632000000000005,42.004928699970996,2.6853170884224604,0.5067739356819696,1.3608487094538979,null,null,{"$f":"MAX($E$6:$E$45)+5","v":64},0.5,null,null,{"$f":"V6+W6","v":3},{"$f":"X6","v":33.874185446686866},{"$f":"Y6","v":30.872833251953125},{"$f":"Z6","v":0.41396383811397325},{"$f":"AA6","v":1.8540697745700523},{"$f":"AB6","v":0.76751784001212797},null,{"$f":"AD6","v":32.632000000000005},{"$f":"AE6","v":32.02838398000322},{"$f":"AF6","v":0.95265995669352044},{"$f":"AG6","v":1.6810605542142403},{"$f":"AH6","v":1.6014790747769236}]
["C",null,null,{"$f":"IF(Inputs!G14=\"\",0,Inputs!G14)","v":5},{"$f":"E7","v":3},{"$f":"'Final Summary'!K27","v":11.900438780020192},{"$f":"'Final Summary'!L27","v":27.375556945800781},{"$f":"'Final Summary'!M27","v":0.40952183783721907},{"$f":"'Final Summary'!N27","v":0.36628433612858424},{"$f":"'PB Liquefaction Initiation'!Q11","v":0.15000143450236353},null,{"$f":"'Final Summary'!P27","v":10.621491593382261},{"$f":"'Final Summary'!Q27","v":46.832199771351362},{"$f":"'Final Summary'!R27","v":2.6589660085161717},{"$f":"'Final Summary'!S27","v":7.2376967184628785E-2},{"$f":"'PB Liquefaction Initiation'!N44","v":0.19244789554341832},null,null,null,null,null,{"$f":"IF(Inputs!$G14=\"\",NA(),Inputs!$G14)","v":5},{"$f":"W7","v":3},{"$f":"'Final Summary'!V27","v":11.900438780020192},{"$f":"'Final Summary'!W27","v":34.456560134887695},{"$f":"'Final Summary'!X27","v":0.75372797671486647},{"$f":"'Final Summary'!Y27","v":0.15109424382340919},{"$f":"'Det Liquefaction Initiation'!T11","v":0.11388395869028091},null,{"$f":"'Final Summary'!AA27","v":10.621491593382261},{"$f":"'Final Summary'!AB27","v":36.955805633264397},{"$f":"'Final Summary'!AC27","v":0.9501872677197607},{"$f":"'Final Summary'!AD27","v":0.23835012409072004},{"$f":"'Det Liquefaction Initiation'!O44","v":0.22647725317042719}]
["D",null,null,null,{"$f":"D8+E8","v":8},{"$f":"F8","v":11.900438780020192},{"$f":"G8","v":27.375556945800781},{"$f":"H8","v":0.40952183783721907},{"$f":"I8","v":0.36628433612858424},{"$f":"J8","v":0.15000143450236353},null,{"$f":"L8","v":10.621491593382261},{"$f":"M8","v":46.832199771351362},{"$f":"N8","v":2.6589660085161717},{"$f":"O8","v":7.2376967184628785E-2},{"$f":"P8","v":0.19244789554341832},null,null,null,null,null,null,{"$f":"V8+W8","v":8},{"$f":"X8","v":11.900438780020192},{"$f":"Y8","v":34.456560134887695},{"$f":"Z8","v":0.75372797671486647},{"$f":"AA8","v":0.15109424382340919},{"$f":"AB8","v":0.11388395869028091},null,{"$f":"AD8","v":10.621491593382261},{"$f":"AE8","v":36.955805633264397},{"$f":"AF8","v":0.9501872677197607},{"$f":"AG8","v":0.23835012409072004},{"$f":"AH8","v":0.22647725317042719}]
["E",null,null,{"$f":"IF(Inputs!G15=\"\",0,Inputs!G15)","v":5},{"$f":"E9","v":8},{"$f":"'Final Summary'!K28","v":13.693403668256009},{"$f":"'Final Summary'!L28","v":27.535186767578125},{"$f":"'Final Summary'!M28","v":0.4161886272075469},{"$f":"'Final Summary'!N28","v":0.39800901685415463},{"$f":"'PB Liquefaction Initiation'!Q12","v":0.165646826340756},null,{"$f":"'Final Summary'!P28","v":13.32533678800505},{"$f":"'Final Summary'!Q28","v":49.042805837838067},{"$f":"'Final Summary'!R28","v":2.6093956450717322},{"$f":"'Final Summary'!S28","v":7.5012592581681872E-2},{"$f":"'PB Liquefaction Initiation'!N45","v":0.1957375324081809},null,null,"FS = 1 line:",null,null,{"$f":"IF(Inputs!$G15=\"\",NA(),Inputs!$G15)","v":5},{"$f":"W9","v":8},{"$f":"'Final Summary'!V28","v":13.693403668256009},{"$f":"'Final Summary'!W28","v":34.541889190673828},{"$f":"'Final Summary'!X28","v":0.76658707737983955},{"$f":"'Final Summary'!Y28","v":0.16405473453769903},{"$f":"'Det Liquefaction Initiation'!T12","v":0.12576223947958012},null,{"$f":"'Final Summary'!AA28","v":13.32533678800505},{"$f":"'Final Summary'!AB28","v":39.374718423613992},{"$f":"'Final Summary'!AC28","v":0.94666571539436606},{"$f":"'Final Summary'!AD28","v":0.24332620501597385},{"$f":"'Det Liquefaction Initiation'!O45","v":0.23034857594564306}]
["F",null,null,null,{"$f":"D10+E10","v":13},{"$f":"F10","v":13.693403668256009},{"$f":"G10","v":27.535186767578125},{"$f":"H10","v":0.4161886272075469},{"$f":"I10","v":0.39800901685415463},{"$f":"J10","v":0.165646826340756},null,{"$f":"L10","v":13.32533678800505},{"$f":"M10","v":49.042805837838067},{"$f":"N10","v":2.6093956450717322},{"$f":"O10","v":7.5012592581681872E-2},{"$f":"P10","v":0.1957375324081809},null,null,"Depth","FS_L",null,null,{"$f":"V10+W10","v":13},{"$f":"X10","v":13.693403668256009},{"$f":"Y10","v":34.541889190673828},{"$f":"Z10","v":0.76658707737983955},{"$f":"AA10","v":0.16405473453769903},{"$f":"AB10","v":0.12576223947958012},null,{"$f":"AD10","v":13.32533678800505},{"$f":"AE10","v":39.374718423613992},{"$f":"AF10","v":0.94666571539436606},{"$f":"AG10","v":0.24332620501597385},{"$f":"AH10","v":0.23034857594564306}]
[null,null,null,{"$f":"IF(Inputs!G16=\"\",0,Inputs!G16)","v":4},{"$f":"E11","v":13},{"$f":"'Final Summary'!K29","v":7.5891695726420965},{"$f":"'Final Summary'!L29","v":{"$error":"#N/A"}},{"$f":"'Final Summary'!M29","v":{"$error":"#N/A"}},{"$f":"'Final Summary'!N29","v":{"$error":"#N/A"}},{"$f":"'PB Liquefaction Initiation'!Q13","v":0.11608672878067261},null,{"$f":"'Final Summary'!P29","v":4.0320252341104634},{"$f":"'Final Summary'!Q29","v":{"$error":"#N/A"}},{"$f":"'Final Summary'!R29","v":{"$error":"#N/A"}},{"$f":"'Final Summary'!S29","v":{"$error":"#N/A"}},{"$f":"'PB Liquefaction Initiation'!N46","v":9.0382852623987819E-2},null,null,0,1,null,{"$f":"IF(Inputs!$G16=\"\",NA(),Inputs!$G16)","v":4},{"$f":"W11","v":13},{"$f":"'Final Summary'!V29","v":7.5891695726420965},{"$f":"'Final Summary'!W29","v":{"$error":"#N/A"}},{"$f":"'Final Summary'!X29","v":{"$error":"#N/A"}},{"$f":"'Final Summary'!Y29","v":{"$error":"#N/A"}},{"$f":"'Det Liquefaction Initiation'!T13","v":8.8135265298010565E-2},null,{"$f":"'Final Summary'!AA29","v":4.0320252341104634},{"$f":"'Final Summary'!AB29","v":{"$error":"#N/A"}},{"$f":"'Final Summary'!AC29","v":{"$error":"#N/A"}},{"$f":"'Final Summary'!AD29","v":{"$error":"#N/A"}},{"$f":"'Det Liquefaction Initiation'!O46","v":0.10636468711797432}]
["No Liners",null,null,null,{"$f":"D12+E12","v":17},{"$f":"F12","v":7.5891695726420965},{"$f":"G12","v":{"$error":"#N/A"}},{"$f":"H12","v":{"$error":"#N/A"}},{"$f":"I12","v":{"$error":"#N/A"}},{"$f":"J12","v":0.11608672878067261},null,{"$f":"L12","v":4.0320252341104634},{"$f":"M12","v":{"$error":"#N/A"}},{"$f":"N12","v":{"$error":"#N/A"}},{"$f":"O12","v":{"$error":"#N/A"}},{"$f":"P12","v":9.0382852623987819E-2},null,null,{"$f":"MAX($E$6:$E$45)","v":59},1,null,null,{"$f":"V12+W12","v":17},{"$f":"X12","v":7.5891695726420965},{"$f":"Y12","v":{"$error":"#N/A"}},{"$f":"Z12","v":{"$error":"#N/A"}},{"$f":"AA12","v":{"$error":"#N/A"}},{"$f":"AB12","v":8.8135265298010565E-2},null,{"$f":"AD12","v":4.0320252341104634},{"$f":"AE12","v":{"$error":"#N/A"}},{"$f":"AF12","v":{"$error":"#N/A"}},{"$f":"AG12","v":{"$error":"#N/A"}},{"$f":"AH12","v":0.10636468711797432}]
["NL",null,null,{"$f":"IF(Inputs!G17=\"\",0,Inputs!G17)","v":7},{"$f":"E13","v":17},{"$f":"'Final Summary'!K30","v":21.708473911296679},{"$f":"'Final Summary'!L30","v":26.788627624511719},{"$f":"'Final Summary'!M30","v":0.38666916463062412},{"$f":"'Final Summary'!N30","v":0.67349663088987843},{"$f":"'PB Liquefaction Initiation'!Q14","v":0.26042037964772907},null,{"$f":"'Final Summary'!P30","v":22.247219944730496},{"$f":"'Final Summary'!Q30","v":50.606475950225416},{"$f":"'Final Summary'!R30","v":2.4282607055619039},{"$f":"'Final Summary'!S30","v":0.12789971804790864},{"$f":"'PB Liquefaction Initiation'!N47","v":0.31057385958818323},null,null,null,null,null,{"$f":"IF(Inputs!$G17=\"\",NA(),Inputs!$G17)","v":7},{"$f":"W13","v":17},{"$f":"'Final Summary'!V30","v":21.708473911296679},{"$f":"'Final Summary'!W30","v":34.183750152587891},{"$f":"'Final Summary'!X30","v":0.71468998628801128},{"$f":"'Final Summary'!Y30","v":0.27664601158220065},{"$f":"'Det Liquefaction Initiation'!T14","v":0.19771613422431597},null,{"$f":"'Final Summary'!AA30","v":22.247219944730496},{"$f":"'Final Summary'!AB30","v":41.802703817817168},{"$f":"'Final Summary'!AC30","v":0.93793401402117049},{"$f":"'Final Summary'!AD30","v":0.38967633874842733},{"$f":"'Det Liquefaction Initiation'!O47","v":0.36549069257138583}]
["L",null,null,null,{"$f":"D14+E14","v":24},{"$f":"F14","v":21.708473911296679},{"$f":"G14","v":26.788627624511719},{"$f":"H14","v":0.38666916463062412},{"$f":"I14","v":0.67349663088987843},{"$f":"J14","v":0.26042037964772907},null,{"$f":"L14","v":22.247219944730496},{"$f":"M14","v":50.606475950225416},{"$f":"N14","v":2.4282607055619039},{"$f":"O14","v":0.12789971804790864},{"$f":"P14","v":0.31057385958818323},null,null,null,null,null,null,{"$f":"V14+W14","v":24},{"$f":"X14","v":21.708473911296679},{"$f":"Y14","v":34.183750152587891},{"$f":"Z14","v":0.71468998628801128},{"$f":"AA14","v":0.27664601158220065},{"$f":"AB14","v":0.19771613422431597},null,{"$f":"AD14","v":22.247219944730496},{"$f":"AE14","v":41.802703817817168},{"$f":"AF14","v":0.93793401402117049},{"$f":"AG14","v":0.38967633874842733},{"$f":"AH14","v":0.36549069257138583}]
[null,null,null,{"$f":"IF(Inputs!G18=\"\",0,Inputs!G18)","v":3},{"$f":"E15","v":24},{"$f":"'Final Summary'!K31","v":29.14039966028972},{"$f":"'Final Summary'!L31","v":25.683929443359375},{"$f":"'Final Summary'!M31","v":0.34978821385211095},{"$f":"'Final Summary'!N31","v":1.4196896207753118},{"$f":"'PB Liquefaction Initiation'!Q15","v":0.49659069667537709},null,{"$f":"'Final Summary'!P31","v":30.426482551232123},{"$f":"'Final Summary'!Q31","v":50.629335939451124},{"$f":"'Final Summary'!R31","v":2.2895929161369906},{"$f":"'Final Summary'!S31","v":0.23106955639281196},{"$f":"'PB Liquefaction Initiation'!N48","v":0.52905521945189915},null,null,null,null,null,{"$f":"IF(Inputs!$G18=\"\",NA(),Inputs!$G18)","v":3},{"$f":"W15","v":24},{"$f":"'Final Summary'!V31","v":29.14039966028972},{"$f":"'Final Summary'!W31","v":33.668972015380859},{"$f":"'Final Summary'!X31","v":0.64883549021389109},{"$f":"'Final Summary'!Y31","v":0.58107357361902523},{"$f":"'Det Liquefaction Initiation'!T15","v":0.37702115698943778},null,{"$f":"'Final Summary'!AA31","v":30.426482551232123},{"$f":"'Final Summary'!AB31","v":42.55745264001893},{"$f":"'Final Summary'!AC31","v":0.93257751573693215},{"$f":"'Final Summary'!AD31","v":0.6676171516200663},{"$f":"'Det Liquefaction Initiation'!O48","v":0.62260474472120819}]
["F_PGA Choice",null,null,null,{"$f":"D16+E16","v":27},{"$f":"F16","v":29.14039966028972},{"$f":"G16","v":25.683929443359375},{"$f":"H16","v":0.34978821385211095},{"$f":"I16","v":1.4196896207753118},{"$f":"J16","v":0.49659069667537709},null,{"$f":"L16","v":30.426482551232123},{"$f":"M16","v":50.629335939451124},{"$f":"N16","v":2.2895929161369906},{"$f":"O16","v":0.23106955639281196},{"$f":"P16","v":0.52905521945189915},null,null,null,null,null,null,{"$f":"V16+W16","v":27},{"$f":"X16","v":29.14039966028972},{"$f":"Y16","v":33.668972015380859},{"$f":"Z16","v":0.64883549021389109},{"$f":"AA16","v":0.58107357361902523},{"$f":"AB16","v":0.37702115698943778},null,{"$f":"AD16","v":30.426482551232123},{"$f":"AE16","v":42.55745264001893},{"$f":"AF16","v":0.93257751573693215},{"$f":"AG16","v":0.6676171516200663},{"$f":"AH16","v":0.62260474472120819}]
[1,null,null,{"$f":"IF(Inputs!G19=\"\",0,Inputs!G19)","v":7},{"$f":"E17","v":27},{"$f":"'Final Summary'!K32","v":21.337630575889257},{"$f":"'Final Summary'!L32","v":26.725074768066406},{"$f":"'Final Summary'!M32","v":0.38434246369067387},{"$f":"'Final Summary'!N32","v":0.66174912583443657},{"$f":"'PB Liquefaction Initiation'!Q16","v":0.25433828936835712},null,{"$f":"'Final Summary'!P32","v":20.884133717749325},{"$f":"'Final Summary'!Q32","v":50.3009279074316},{"$f":"'Final Summary'!R32","v":2.1275275435569823},{"$f":"'Final Summary'!S32","v":0.11845791274525296},{"$f":"'PB Liquefaction Initiation'!N49","v":0.25202247211779544},null,null,null,null,null,{"$f":"IF(Inputs!$G19=\"\",NA(),Inputs!$G19)","v":7},{"$f":"W17","v":27},{"$f":"'Final Summary'!V32","v":21.337630575889257},{"$f":"'Final Summary'!W32","v":34.15599250793457},{"$f":"'Final Summary'!X32","v":0.71089441090745842},{"$f":"'Final Summary'!Y32","v":0.27162753281988083},{"$f":"'Det Liquefaction Initiation'!T16","v":0.19309849493023551},null,{"$f":"'Final Summary'!AA32","v":20.884133717749325},{"$f":"'Final Summary'!AB32","v":43.150591476199544},{"$f":"'Final Summary'!AC32","v":0.92645544117795442},{"$f":"'Final Summary'!AD32","v":0.32012983712466553},{"$f":"'Det Liquefaction Initiation'!O49","v":0.29658602948755869}]
[2,null,null,null,{"$f":"D18+E18","v":34},{"$f":"F18","v":21.337630575889257},{"$f":"G18","v":26.725074768066406},{"$f":"H18","v":0.38434246369067387},{"$f":"I18","v":0.66174912583443657},{"$f":"J18","v":0.25433828936835712},null,{"$f":"L18","v":20.884133717749325},{"$f":"M18","v":50.3009279074316},{"$f":"N18","v":2.1275275435569823},{"$f":"O18","v":0.11845791274525296},{"$f":"P18","v":0.25202247211779544},null,null,null,null,null,null,{"$f":"V18+W18","v":34},{"$f":"X18","v":21.337630575889257},{"$f":"Y18","v":34.15599250793457},{"$f":"Z18","v":0.71089441090745842},{"$f":"AA18","v":0.27162753281988083},{"$f":"AB18","v":0.19309849493023551},null,{"$f":"AD18","v":20.884133717749325},{"$f":"AE18","v":43.150591476199544},{"$f":"AF18","v":0.92645544117795442},{"$f":"AG18","v":0.32012983712466553},{"$f":"AH18","v":0.29658602948755869}]
[null,null,null,{"$f":"IF(Inputs!G20=\"\",0,Inputs!G20)","v":3},{"$f":"E19","v":34},{"$f":"'Final Summary'!K33","v":9.4876390112066709},{"$f":"'Final Summary'!L33","v":27.469764709472656},{"$f":"'Final Summary'!M33","v":0.41343030456417246},{"$f":"'Final Summary'!N33","v":0.31547101888912921},{"$f":"'PB Liquefaction Initiation'!Q17","v":0.1304252794205025},null,{"$f":"'Final Summary'!P33","v":9.1514758932516074},{"$f":"'Final Summary'!Q33","v":49.75511132234022},{"$f":"'Final Summary'!R33","v":1.9607514306875602},{"$f":"'Final Summary'!S33","v":5.2632258672442339E-2},{"$f":"'PB Liquefaction Initiation'!N50","v":0.10319877649230906},null,null,null,null,null,{"$f":"IF(Inputs!$G20=\"\",NA(),Inputs!$G20)","v":3},{"$f":"W19","v":34},{"$f":"'Final Summary'!V33","v":9.4876390112066709},{"$f":"'Final Summary'!W33","v":34.513477325439453},{"$f":"'Final Summary'!X33","v":0.76226618833284232},{"$f":"'Final Summary'!Y33","v":0.12990392170651952},{"$f":"'Det Liquefaction Initiation'!T17","v":9.9021367248716616E-2},null,{"$f":"'Final Summary'!AA33","v":9.1514758932516074},{"$f":"'Final Summary'!AB33","v":43.626351273603085},{"$f":"'Final Summary'!AC33","v":0.91948539635050286},{"$f":"'Final Summary'!AD33","v":0.13208123927108129},{"$f":"'Det Liquefaction Initiation'!O50","v":0.12144677064163578}]
["Method Selection",null,null,null,{"$f":"D20+E20","v":37},{"$f":"F20","v":9.4876390112066709},{"$f":"G20","v":27.469764709472656},{"$f":"H20","v":0.41343030456417246},{"$f":"I20","v":0.31547101888912921},{"$f":"J20","v":0.1304252794205025},null,{"$f":"L20","v":9.1514758932516074},{"$f":"M20","v":49.75511132234022},{"$f":"N20","v":1.9607514306875602},{"$f":"O20","v":5.2632258672442339E-2},{"$f":"P20","v":0.10319877649230906},null,null,null,null,null,null,{"$f":"V20+W20","v":37},{"$f":"X20","v":9.4876390112066709},{"$f":"Y20","v":34.513477325439453},{"$f":"Z20","v":0.76226618833284232},{"$f":"AA20","v":0.12990392170651952},{"$f":"AB20","v":9.9021367248716616E-2},null,{"$f":"AD20","v":9.1514758932516074},{"$f":"AE20","v":43.626351273603085},{"$f":"AF20","v":0.91948539635050286},{"$f":"AG20","v":0.13208123927108129},{"$f":"AH20","v":0.12144677064163578}]
[true,null,null,{"$f":"IF(Inputs!G21=\"\",0,Inputs!G21)","v":8},{"$f":"E21","v":37},{"$f":"'Final Summary'!K34","v":7.3030476983682764},{"$f":"'Final Summary'!L34","v":{"$error":"#N/A"}},{"$f":"'Final Summary'!M34","v":{"$error":"#N/A"}},{"$f":"'Final Summary'!N34","v":{"$error":"#N/A"}},{"$f":"'PB Liquefaction Initiation'!Q18","v":0.11400729285551024},null,{"$f":"'Final Summary'!P34","v":4.144728715335928},{"$f":"'Final Summary'!Q34","v":{"$error":"#N/A"}},{"$f":"'Final Summary'!R34","v":{"$error":"#N/A"}},{"$f":"'Final Summary'!S34","v":{"$error":"#N/A"}},{"$f":"'PB Liquefaction Initiation'!N51","v":6.8970953672722005E-2},null,null,null,null,null,{"$f":"IF(Inputs!$G21=\"\",NA(),Inputs!$G21)","v":8},{"$f":"W21","v":37},{"$f":"'Final Summary'!V34","v":7.3030476983682764},{"$f":"'Final Summary'!W34","v":{"$error":"#N/A"}},{"$f":"'Final Summary'!X34","v":{"$error":"#N/A"}},{"$f":"'Final Summary'!Y34","v":{"$error":"#N/A"}},{"$f":"'Det Liquefaction Initiation'!T18","v":8.6556517762789179E-2},null,{"$f":"'Final Summary'!AA34","v":4.144728715335928},{"$f":"'Final Summary'!AB34","v":{"$error":"#N/A"}},{"$f":"'Final Summary'!AC34","v":{"$error":"#N/A"}},{"$f":"'Final Summary'!AD34","v":{"$error":"#N/A"}},{"$f":"'Det Liquefaction Initiation'!O51","v":8.1166656004397583E-2}]
[false,null,null,null,{"$f":"D22+E22","v":45},{"$f":"F22","v":7.3030476983682764},{"$f":"G22","v":{"$error":"#N/A"}},{"$f":"H22","v":{"$error":"#N/A"}},{"$f":"I22","v":{"$error":"#N/A"}},{"$f":"J22","v":0.11400729285551024},null,{"$f":"L22","v":4.144728715335928},{"$f":"M22","v":{"$error":"#N/A"}},{"$f":"N22","v":{"$error":"#N/A"}},{"$f":"O22","v":{"$error":"#N/A"}},{"$f":"P22","v":6.8970953672722005E-2},null,null,null,null,null,null,{"$f":"V22+W22","v":45},{"$f":"X22","v":7.3030476983682764},{"$f":"Y22","v":{"$error":"#N/A"}},{"$f":"Z22","v":{"$error":"#N/A"}},{"$f":"AA22","v":{"$error":"#N/A"}},{"$f":"AB22","v":8.6556517762789179E-2},null,{"$f":"AD22","v":4.144728715335928},{"$f":"AE22","v":{"$error":"#N/A"}},{"$f":"AF22","v":{"$error":"#N/A"}},{"$f":"AG22","v":{"$error":"#N/A"}},{"$f":"AH22","v":8.1166656004397583E-2}]
[null,null,null,{"$f":"IF(Inputs!G22=\"\",0,Inputs!G22)","v":3},{"$f":"E23","v":45},{"$f":"'Final Summary'!K35","v":1.6327566637818389},{"$f":"'Final Summary'!L35","v":27.121719360351563},{"$f":"'Final Summary'!M35","v":0.3993356758905604},{"$f":"'Final Summary'!N35","v":0.19468062364165611},{"$f":"'PB Liquefaction Initiation'!Q19","v":7.774291842473656E-2},null,{"$f":"'Final Summary'!P35","v":2.0632593460236448},{"$f":"'Final Summary'!Q35","v":48.692972152870666},{"$f":"'Final Summary'!R35","v":1.6999817010556288},{"$f":"'Final Summary'!S35","v":3.399931176180504E-2},{"$f":"'PB Liquefaction Initiation'!N52","v":5.7798207843553974E-2},null,null,null,null,null,{"$f":"IF(Inputs!$G22=\"\",NA(),Inputs!$G22)","v":3},{"$f":"W23","v":45},{"$f":"'Final Summary'!V35","v":1.6327566637818389},{"$f":"'Final Summary'!W35","v":34.336931228637695},{"$f":"'Final Summary'!X35","v":0.73623162212844251},{"$f":"'Final Summary'!Y35","v":8.0170301250297227E-2},{"$f":"'Det Liquefaction Initiation'!T19","v":5.902391093603223E-2},null,{"$f":"'Final Summary'!AA35","v":2.0632593460236448},{"$f":"'Final Summary'!AB35","v":44.292057499753916},{"$f":"'Final Summary'!AC35","v":0.90361270859979537},{"$f":"'Final Summary'!AD35","v":7.5273734828321059E-2},{"$f":"'Det Liquefaction Initiation'!O52","v":6.8018303414641948E-2}]
["FF/GS Option",null,null,null,{"$f":"D24+E24","v":48},{"$f":"F24","v":1.6327566637818389},{"$f":"G24","v":27.121719360351563},{"$f":"H24","v":0.3993356758905604},{"$f":"I24","v":0.19468062364165611},{"$f":"J24","v":7.774291842473656E-2},null,{"$f":"L24","v":2.0632593460236448},{"$f":"M24","v":48.692972152870666},{"$f":"N24","v":1.6999817010556288},{"$f":"O24","v":3.399931176180504E-2},{"$f":"P24","v":5.7798207843553974E-2},null,null,null,null,null,null,{"$f":"V24+W24","v":48},{"$f":"X24","v":1.6327566637818389},{"$f":"Y24","v":34.336931228637695},{"$f":"Z24","v":0.73623162212844251},{"$f":"AA24","v":8.0170301250297227E-2},{"$f":"AB24","v":5.902391093603223E-2},null,{"$f":"AD24","v":2.0632593460236448},{"$f":"AE24","v":44.292057499753916},{"$f":"AF24","v":0.90361270859979537},{"$f":"AG24","v":7.5273734828321059E-2},{"$f":"AH24","v":6.8018303414641948E-2}]
["FF",null,null,{"$f":"IF(Inputs!G23=\"\",0,Inputs!G23)","v":7},{"$f":"E25","v":48},{"$f":"'Final Summary'!K36","v":9.6599215676559655},{"$f":"'Final Summary'!L36","v":26.560958862304688},{"$f":"'Final Summary'!M36","v":0.37845267566951402},{"$f":"'Final Summary'!N36","v":0.34818708198556969},{"$f":"'PB Liquefaction Initiation'!Q20","v":0.13177233281099929},null,{"$f":"'Final Summary'!P36","v":10.322847584760181},{"$f":"'Final Summary'!Q36","v":48.264406886072805},{"$f":"'Final Summary'!R36","v":1.5875075349827623},{"$f":"'Final Summary'!S36","v":6.3839566880304122E-2},{"$f":"'PB Liquefaction Initiation'!N53","v":0.10134579345251878},null,null,null,null,null,{"$f":"IF(Inputs!$G23=\"\",NA(),Inputs!$G23)","v":7},{"$f":"W25","v":48},{"$f":"'Final Summary'!V36","v":9.6599215676559655},{"$f":"'Final Summary'!W36","v":34.066644668579102},{"$f":"'Final Summary'!X36","v":0.69886017471582129},{"$f":"'Final Summary'!Y36","v":0.14315320799813824},{"$f":"'Det Liquefaction Initiation'!T20","v":0.1000440759527092},null,{"$f":"'Final Summary'!AA36","v":10.322847584760181},{"$f":"'Final Summary'!AB36","v":44.606581970585999},{"$f":"'Final Summary'!AC36","v":0.89054594014891797},{"$f":"'Final Summary'!AD36","v":0.13392474304154969},{"$f":"'Det Liquefaction Initiation'!O53","v":0.11926613620113914}]
["GS",null,null,null,{"$f":"D26+E26","v":55},{"$f":"F26","v":9.6599215676559655},{"$f":"G26","v":26.560958862304688},{"$f":"H26","v":0.37845267566951402},{"$f":"I26","v":0.34818708198556969},{"$f":"J26","v":0.13177233281099929},null,{"$f":"L26","v":10.322847584760181},{"$f":"M26","v":48.264406886072805},{"$f":"N26","v":1.5875075349827623},{"$f":"O26","v":6.3839566880304122E-2},{"$f":"P26","v":0.10134579345251878},null,null,null,null,null,null,{"$f":"V26+W26","v":55},{"$f":"X26","v":9.6599215676559655},{"$f":"Y26","v":34.066644668579102},{"$f":"Z26","v":0.69886017471582129},{"$f":"AA26","v":0.14315320799813824},{"$f":"AB26","v":0.1000440759527092},null,{"$f":"AD26","v":10.322847584760181},{"$f":"AE26","v":44.606581970585999},{"$f":"AF26","v":0.89054594014891797},{"$f":"AG26","v":0.13392474304154969},{"$f":"AH26","v":0.11926613620113914}]
[null,null,null,{"$f":"IF(Inputs!G24=\"\",0,Inputs!G24)","v":4},{"$f":"E27","v":55},{"$f":"'Final Summary'!K37","v":2.3758590121854533},{"$f":"'Final Summary'!L37","v":26.304130554199219},{"$f":"'Final Summary'!M37","v":0.36959317274726489},{"$f":"'Final Summary'!N37","v":0.22163239568277454},{"$f":"'PB Liquefaction Initiation'!Q21","v":8.1913820303973858E-2},null,{"$f":"'Final Summary'!P37","v":2.9720420997108414},{"$f":"'Final Summary'!Q37","v":48.128747582366231},{"$f":"'Final Summary'!R37","v":1.5283968779578039},{"$f":"'Final Summary'!S37","v":3.783207723839474E-2},{"$f":"'PB Liquefaction Initiation'!N54","v":5.7822428737821022E-2},null,null,null,null,null,{"$f":"IF(Inputs!$G24=\"\",NA(),Inputs!$G24)","v":4},{"$f":"W27","v":55},{"$f":"'Final Summary'!V37","v":2.3758590121854533},{"$f":"'Final Summary'!W37","v":33.938884735107422},{"$f":"'Final Summary'!X37","v":0.68217702333422126},{"$f":"'Final Summary'!Y37","v":9.1164811049488759E-2},{"$f":"'Det Liquefaction Initiation'!T21","v":6.2190539434566962E-2},null,{"$f":"'Final Summary'!AA37","v":2.9720420997108414},{"$f":"'Final Summary'!AB37","v":44.798084490646112},{"$f":"'Final Summary'!AC37","v":0.87797090607324668},{"$f":"'Final Summary'!AD37","v":7.7504626482994235E-2},{"$f":"'Det Liquefaction Initiation'!O54","v":6.8046807138142998E-2}]
["PL/FSL Option",null,null,null,{"$f":"D28+E28","v":59},{"$f":"F28","v":2.3758590121854533},{"$f":"G28","v":26.304130554199219},{"$f":"H28","v":0.36959317274726489},{"$f":"I28","v":0.22163239568277454},{"$f":"J28","v":8.1913820303973858E-2},null,{"$f":"L28","v":2.9720420997108414},{"$f":"M28","v":48.128747582366231},{"$f":"N28","v":1.5283968779578039},{"$f":"O28","v":3.783207723839474E-2},{"$f":"P28","v":5.7822428737821022E-2},null,null,null,null,null,null,{"$f":"V28+W28","v":59},{"$f":"X28","v":2.3758590121854533},{"$f":"Y28","v":33.938884735107422},{"$f":"Z28","v":0.68217702333422126},{"$f":"AA28","v":9.1164811049488759E-2},{"$f":"AB28","v":6.2190539434566962E-2},null,{"$f":"AD28","v":2.9720420997108414},{"$f":"AE28","v":44.798084490646112},{"$f":"AF28","v":0.87797090607324668},{"$f":"AG28","v":7.7504626482994235E-2},{"$f":"AH28","v":6.8046807138142998E-2}]
["PL",null,null,{"$f":"IF(Inputs!G25=\"\",0,Inputs!G25)","v":0},{"$f":"E29","v":59},{"$f":"'Final Summary'!K38","v":{"$error":"#N/A"}},{"$f":"'Final Summary'!L38","v":{"$error":"#N/A"}},{"$f":"'Final Summary'!M38","v":{"$error":"#N/A"}},{"$f":"'Final Summary'!N38","v":{"$error":"#N/A"}},{"$f":"'PB Liquefaction Initiation'!Q22","v":{"$error":"#N/A"}},null,{"$f":"'Final Summary'!P38","v":{"$error":"#N/A"}},{"$f":"'Final Summary'!Q38","v":{"$error":"#N/A"}},{"$f":"'Final Summary'!R38","v":{"$error":"#N/A"}},{"$f":"'Final Summary'!S38","v":{"$error":"#N/A"}},{"$f":"'PB Liquefaction Initiation'!N55","v":{"$error":"#N/A"}},null,null,null,null,null,{"$f":"IF(Inputs!$G25=\"\",NA(),Inputs!$G25)","v":{"$error":"#N/A"}},{"$f":"W29","v":59},{"$f":"'Final Summary'!V38","v":{"$error":"#N/A"}},{"$f":"'Final Summary'!W38","v":{"$error":"#N/A"}},{"$f":"'Final Summary'!X38","v":{"$error":"#N/A"}},{"$f":"'Final Summary'!Y38","v":{"$error":"#N/A"}},{"$f":"'Det Liquefaction Initiation'!T22","v":{"$error":"#N/A"}},null,{"$f":"'Final Summary'!AA38","v":{"$error":"#N/A"}},{"$f":"'Final Summary'!AB38","v":{"$error":"#N/A"}},{"$f":"'Final Summary'!AC38","v":{"$error":"#N/A"}},{"$f":"'Final Summary'!AD38","v":{"$error":"#N/A"}},{"$f":"'Det Liquefaction Initiation'!O55","v":{"$error":"#N/A"}}]
["FSL",null,null,null,{"$f":"D30+E30","v":59},{"$f":"F30","v":{"$error":"#N/A"}},{"$f":"G30","v":{"$error":"#N/A"}},{"$f":"H30","v":{"$error":"#N/A"}},{"$f":"I30","v":{"$error":"#N/A"}},{"$f":"J30","v":{"$error":"#N/A"}},null,{"$f":"L30","v":{"$error":"#N/A"}},{"$f":"M30","v":{"$error":"#N/A"}},{"$f":"N30","v":{"$error":"#N/A"}},{"$f":"O30","v":{"$error":"#N/A"}},{"$f":"P30","v":{"$error":"#N/A"}},null,null,null,null,null,null,{"$f":"V30+W30","v":{"$error":"#N/A"}},{"$f":"X30","v":{"$error":"#N/A"}},{"$f":"Y30","v":{"$error":"#N/A"}},{"$f":"Z30","v":{"$error":"#N/A"}},{"$f":"AA30","v":{"$error":"#N/A"}},{"$f":"AB30","v":{"$error":"#N/A"}},null,{"$f":"AD30","v":{"$error":"#N/A"}},{"$f":"AE30","v":{"$error":"#N/A"}},{"$f":"AF30","v":{"$error":"#N/A"}},{"$f":"AG30","v":{"$error":"#N/A"}},{"$f":"AH30","v":{"$error":"#N/A"}}]
[null,null,null,{"$f":"IF(Inputs!G26=\"\",0,Inputs!G26)","v":0},{"$f":"E31","v":59},{"$f":"'Final Summary'!K39","v":{"$error":"#N/A"}},{"$f":"'Final Summary'!L39","v":{"$error":"#N/A"}},{"$f":"'Final Summary'!M39","v":{"$error":"#N/A"}},{"$f":"'Final Summary'!N39","v":{"$error":"#N/A"}},{"$f":"'PB Liquefaction Initiation'!Q23","v":{"$error":"#N/A"}},null,{"$f":"'Final Summary'!P39","v":{"$error":"#N/A"}},{"$f":"'Final Summary'!Q39","v":{"$error":"#N/A"}},{"$f":"'Final Summary'!R39","v":{"$error":"#N/A"}},{"$f":"'Final Summary'!S39","v":{"$error":"#N/A"}},{"$f":"'PB Liquefaction Initiation'!N56","v":{"$error":"#N/A"}},null,null,null,null,null,{"$f":"IF(Inputs!$G26=\"\",NA(),Inputs!$G26)","v":{"$error":"#N/A"}},{"$f":"W31","v":{"$error":"#N/A"}},{"$f":"'Final Summary'!V39","v":{"$error":"#N/A"}},{"$f":"'Final Summary'!W39","v":{"$error":"#N/A"}},{"$f":"'Final Summary'!X39","v":{"$error":"#N/A"}},{"$f":"'Final Summary'!Y39","v":{"$error":"#N/A"}},{"$f":"'Det Liquefaction Initiation'!T23","v":{"$error":"#N/A"}},null,{"$f":"'Final Summary'!AA39","v":{"$error":"#N/A"}},{"$f":"'Final Summary'!AB39","v":{"$error":"#N/A"}},{"$f":"'Final Summary'!AC39","v":{"$error":"#N/A"}},{"$f":"'Final Summary'!AD39","v":{"$error":"#N/A"}},{"$f":"'Det Liquefaction Initiation'!O56","v":{"$error":"#N/A"}}]
["Liquefiable?",null,null,null,{"$f":"D32+E32","v":59},{"$f":"F32","v":{"$error":"#N/A"}},{"$f":"G32","v":{"$error":"#N/A"}},{"$f":"H32","v":{"$error":"#N/A"}},{"$f":"I32","v":{"$error":"#N/A"}},{"$f":"J32","v":{"$error":"#N/A"}},null,{"$f":"L32","v":{"$error":"#N/A"}},{"$f":"M32","v":{"$error":"#N/A"}},{"$f":"N32","v":{"$error":"#N/A"}},{"$f":"O32","v":{"$error":"#N/A"}},{"$f":"P32","v":{"$error":"#N/A"}},null,null,null,null,null,null,{"$f":"V32+W32","v":{"$error":"#N/A"}},{"$f":"X32","v":{"$error":"#N/A"}},{"$f":"Y32","v":{"$error":"#N/A"}},{"$f":"Z32","v":{"$error":"#N/A"}},{"$f":"AA32","v":{"$error":"#N/A"}},{"$f":"AB32","v":{"$error":"#N/A"}},null,{"$f":"AD32","v":{"$error":"#N/A"}},{"$f":"AE32","v":{"$error":"#N/A"}},{"$f":"AF32","v":{"$error":"#N/A"}},{"$f":"AG32","v":{"$error":"#N/A"}},{"$f":"AH32","v":{"$error":"#N/A"}}]
["Yes",null,null,{"$f":"IF(Inputs!G27=\"\",0,Inputs!G27)","v":0},{"$f":"E33","v":59},{"$f":"'Final Summary'!K40","v":{"$error":"#N/A"}},{"$f":"'Final Summary'!L40","v":{"$error":"#N/A"}},{"$f":"'Final Summary'!M40","v":{"$error":"#N/A"}},{"$f":"'Final Summary'!N40","v":{"$error":"#N/A"}},{"$f":"'PB Liquefaction Initiation'!Q24","v":{"$error":"#N/A"}},null,{"$f":"'Final Summary'!P40","v":{"$error":"#N/A"}},{"$f":"'Final Summary'!Q40","v":{"$error":"#N/A"}},{"$f":"'Final Summary'!R40","v":{"$error":"#N/A"}},{"$f":"'Final Summary'!S40","v":{"$error":"#N/A"}},{"$f":"'PB Liquefaction Initiation'!N57","v":{"$error":"#N/A"}},null,null,null,null,null,{"$f":"IF(Inputs!$G27=\"\",NA(),Inputs!$G27)","v":{"$error":"#N/A"}},{"$f":"W33","v":{"$error":"#N/A"}},{"$f":"'Final Summary'!V40","v":{"$error":"#N/A"}},{"$f":"'Final Summary'!W40","v":{"$error":"#N/A"}},{"$f":"'Final Summary'!X40","v":{"$error":"#N/A"}},{"$f":"'Final Summary'!Y40","v":{"$error":"#N/A"}},{"$f":"'Det Liquefaction Initiation'!T24","v":{"$error":"#N/A"}},null,{"$f":"'Final Summary'!AA40","v":{"$error":"#N/A"}},{"$f":"'Final Summary'!AB40","v":{"$error":"#N/A"}},{"$f":"'Final Summary'!AC40","v":{"$error":"#N/A"}},{"$f":"'Final Summary'!AD40","v":{"$error":"#N/A"}},{"$f":"'Det Liquefaction Initiation'!O57","v":{"$error":"#N/A"}}]
["No",null,null,null,{"$f":"D34+E34","v":59},{"$f":"F34","v":{"$error":"#N/A"}},{"$f":"G34","v":{"$error":"#N/A"}},{"$f":"H34","v":{"$error":"#N/A"}},{"$f":"I34","v":{"$error":"#N/A"}},{"$f":"J34","v":{"$error":"#N/A"}},null,{"$f":"L34","v":{"$error":"#N/A"}},{"$f":"M34","v":{"$error":"#N/A"}},{"$f":"N34","v":{"$error":"#N/A"}},{"$f":"O34","v":{"$error":"#N/A"}},{"$f":"P34","v":{"$error":"#N/A"}},null,null,null,null,null,null,{"$f":"V34+W34","v":{"$error":"#N/A"}},{"$f":"X34","v":{"$error":"#N/A"}},{"$f":"Y34","v":{"$error":"#N/A"}},{"$f":"Z34","v":{"$error":"#N/A"}},{"$f":"AA34","v":{"$error":"#N/A"}},{"$f":"AB34","v":{"$error":"#N/A"}},null,{"$f":"AD34","v":{"$error":"#N/A"}},{"$f":"AE34","v":{"$error":"#N/A"}},{"$f":"AF34","v":{"$error":"#N/A"}},{"$f":"AG34","v":{"$error":"#N/A"}},{"$f":"AH34","v":{"$error":"#N/A"}}]
[null,null,null,{"$f":"IF(Inputs!G28=\"\",0,Inputs!G28)","v":0},{"$f":"E35","v":59},{"$f":"'Final Summary'!K41","v":{"$error":"#N/A"}},{"$f":"'Final Summary'!L41","v":{"$error":"#N/A"}},{"$f":"'Final Summary'!M41","v":{"$error":"#N/A"}},{"$f":"'Final Summary'!N41","v":{"$error":"#N/A"}},{"$f":"'PB Liquefaction Initiation'!Q25","v":{"$error":"#N/A"}},null,{"$f":"'Final Summary'!P41","v":{"$error":"#N/A"}},{"$f":"'Final Summary'!Q41","v":{"$error":"#N/A"}},{"$f":"'Final Summary'!R41","v":{"$error":"#N/A"}},{"$f":"'Final Summary'!S41","v":{"$error":"#N/A"}},{"$f":"'PB Liquefaction Initiation'!N58","v":{"$error":"#N/A"}},null,null,null,null,null,{"$f":"IF(Inputs!$G28=\"\",NA(),Inputs!$G28)","v":{"$error":"#N/A"}},{"$f":"W35","v":{"$error":"#N/A"}},{"$f":"'Final Summary'!V41","v":{"$error":"#N/A"}},{"$f":"'Final Summary'!W41","v":{"$error":"#N/A"}},{"$f":"'Final Summary'!X41","v":{"$error":"#N/A"}},{"$f":"'Final Summary'!Y41","v":{"$error":"#N/A"}},{"$f":"'Det Liquefaction Initiation'!T25","v":{"$error":"#N/A"}},null,{"$f":"'Final Summary'!AA41","v":{"$error":"#N/A"}},{"$f":"'Final Summary'!AB41","v":{"$error":"#N/A"}},{"$f":"'Final Summary'!AC41","v":{"$error":"#N/A"}},{"$f":"'Final Summary'!AD41","v":{"$error":"#N/A"}},{"$f":"'Det Liquefaction Initiation'!O58","v":{"$error":"#N/A"}}]
["Settlement Chart Title",null,null,null,{"$f":"D36+E36","v":59},{"$f":"F36","v":{"$error":"#N/A"}},{"$f":"G36","v":{"$error":"#N/A"}},{"$f":"H36","v":{"$error":"#N/A"}},{"$f":"I36","v":{"$error":"#N/A"}},{"$f":"J36","v":{"$error":"#N/A"}},null,{"$f":"L36","v":{"$error":"#N/A"}},{"$f":"M36","v":{"$error":"#N/A"}},{"$f":"N36","v":{"$error":"#N/A"}},{"$f":"O36","v":{"$error":"#N/A"}},{"$f":"P36","v":{"$error":"#N/A"}},null,null,null,null,null,null,{"$f":"V36+W36","v":{"$error":"#N/A"}},{"$f":"X36","v":{"$error":"#N/A"}},{"$f":"Y36","v":{"$error":"#N/A"}},{"$f":"Z36","v":{"$error":"#N/A"}},{"$f":"AA36","v":{"$error":"#N/A"}},{"$f":"AB36","v":{"$error":"#N/A"}},null,{"$f":"AD36","v":{"$error":"#N/A"}},{"$f":"AE36","v":{"$error":"#N/A"}},{"$f":"AF36","v":{"$error":"#N/A"}},{"$f":"AG36","v":{"$error":"#N/A"}},{"$f":"AH36","v":{"$error":"#N/A"}}]
[{"$f":"IF(units=1,\"Cumulative Settlement [cm]\",\"Cumulative Settlement [in]\")","v":"Cumulative Settlement [in]"},null,null,{"$f":"IF(Inputs!G29=\"\",0,Inputs!G29)","v":0},{"$f":"E37","v":59},{"$f":"'Final Summary'!K42","v":{"$error":"#N/A"}},{"$f":"'Final Summary'!L42","v":{"$error":"#N/A"}},{"$f":"'Final Summary'!M42","v":{"$error":"#N/A"}},{"$f":"'Final Summary'!N42","v":{"$error":"#N/A"}},{"$f":"'PB Liquefaction Initiation'!Q26","v":{"$error":"#N/A"}},null,{"$f":"'Final Summary'!P42","v":{"$error":"#N/A"}},{"$f":"'Final Summary'!Q42","v":{"$error":"#N/A"}},{"$f":"'Final Summary'!R42","v":{"$error":"#N/A"}},{"$f":"'Final Summary'!S42","v":{"$error":"#N/A"}},{"$f":"'PB Liquefaction Initiation'!N59","v":{"$error":"#N/A"}},null,null,null,null,null,{"$f":"IF(Inputs!$G29=\"\",NA(),Inputs!$G29)","v":{"$error":"#N/A"}},{"$f":"W37","v":{"$error":"#N/A"}},{"$f":"'Final Summary'!V42","v":{"$error":"#N/A"}},{"$f":"'Final Summary'!W42","v":{"$error":"#N/A"}},{"$f":"'Final Summary'!X42","v":{"$error":"#N/A"}},{"$f":"'Final Summary'!Y42","v":{"$error":"#N/A"}},{"$f":"'Det Liquefaction Initiation'!T26","v":{"$error":"#N/A"}},null,{"$f":"'Final Summary'!AA42","v":{"$error":"#N/A"}},{"$f":"'Final Summary'!AB42","v":{"$error":"#N/A"}},{"$f":"'Final Summary'!AC42","v":{"$error":"#N/A"}},{"$f":"'Final Summary'!AD42","v":{"$error":"#N/A"}},{"$f":"'Det Liquefaction Initiation'!O59","v":{"$error":"#N/A"}}]
[null,null,null,null,{"$f":"D38+E38","v":59},{"$f":"F38","v":{"$error":"#N/A"}},{"$f":"G38","v":{"$error":"#N/A"}},{"$f":"H38","v":{"$error":"#N/A"}},{"$f":"I38","v":{"$error":"#N/A"}},{"$f":"J38","v":{"$error":"#N/A"}},null,{"$f":"L38","v":{"$error":"#N/A"}},{"$f":"M38","v":{"$error":"#N/A"}},{"$f":"N38","v":{"$error":"#N/A"}},{"$f":"O38","v":{"$error":"#N/A"}},{"$f":"P38","v":{"$error":"#N/A"}},null,null,null,null,null,null,{"$f":"V38+W38","v":{"$error":"#N/A"}},{"$f":"X38","v":{"$error":"#N/A"}},{"$f":"Y38","v":{"$error":"#N/A"}},{"$f":"Z38","v":{"$error":"#N/A"}},{"$f":"AA38","v":{"$error":"#N/A"}},{"$f":"AB38","v":{"$error":"#N/A"}},null,{"$f":"AD38","v":{"$error":"#N/A"}},{"$f":"AE38","v":{"$error":"#N/A"}},{"$f":"AF38","v":{"$error":"#N/A"}},{"$f":"AG38","v":{"$error":"#N/A"}},{"$f":"AH38","v":{"$error":"#N/A"}}]
["Depth Title",null,null,{"$f":"IF(Inputs!G30=\"\",0,Inputs!G30)","v":0},{"$f":"E39","v":59},{"$f":"'Final Summary'!K43","v":{"$error":"#N/A"}},{"$f":"'Final Summary'!L43","v":{"$error":"#N/A"}},{"$f":"'Final Summary'!M43","v":{"$error":"#N/A"}},{"$f":"'Final Summary'!N43","v":{"$error":"#N/A"}},{"$f":"'PB Liquefaction Initiation'!Q27","v":{"$error":"#N/A"}},null,{"$f":"'Final Summary'!P43","v":{"$error":"#N/A"}},{"$f":"'Final Summary'!Q43","v":{"$error":"#N/A"}},{"$f":"'Final Summary'!R43","v":{"$error":"#N/A"}},{"$f":"'Final Summary'!S43","v":{"$error":"#N/A"}},{"$f":"'PB Liquefaction Initiation'!N60","v":{"$error":"#N/A"}},null,null,null,null,null,{"$f":"IF(Inputs!$G30=\"\",NA(),Inputs!$G30)","v":{"$error":"#N/A"}},{"$f":"W39","v":{"$error":"#N/A"}},{"$f":"'Final Summary'!V43","v":{"$error":"#N/A"}},{"$f":"'Final Summary'!W43","v":{"$error":"#N/A"}},{"$f":"'Final Summary'!X43","v":{"$error":"#N/A"}},{"$f":"'Final Summary'!Y43","v":{"$error":"#N/A"}},{"$f":"'Det Liquefaction Initiation'!T27","v":{"$error":"#N/A"}},null,{"$f":"'Final Summary'!AA43","v":{"$error":"#N/A"}},{"$f":"'Final Summary'!AB43","v":{"$error":"#N/A"}},{"$f":"'Final Summary'!AC43","v":{"$error":"#N/A"}},{"$f":"'Final Summary'!AD43","v":{"$error":"#N/A"}},{"$f":"'Det Liquefaction Initiation'!O60","v":{"$error":"#N/A"}}]
[{"$f":"IF(units=1,\"Depth [m]\",\"Depth [ft]\")","v":"Depth [ft]"},null,null,null,{"$f":"D40+E40","v":59},{"$f":"F40","v":{"$error":"#N/A"}},{"$f":"G40","v":{"$error":"#N/A"}},{"$f":"H40","v":{"$error":"#N/A"}},{"$f":"I40","v":{"$error":"#N/A"}},{"$f":"J40","v":{"$error":"#N/A"}},null,{"$f":"L40","v":{"$error":"#N/A"}},{"$f":"M40","v":{"$error":"#N/A"}},{"$f":"N40","v":{"$error":"#N/A"}},{"$f":"O40","v":{"$error":"#N/A"}},{"$f":"P40","v":{"$error":"#N/A"}},null,null,null,null,null,null,{"$f":"V40+W40","v":{"$error":"#N/A"}},{"$f":"X40","v":{"$error":"#N/A"}},{"$f":"Y40","v":{"$error":"#N/A"}},{"$f":"Z40","v":{"$error":"#N/A"}},{"$f":"AA40","v":{"$error":"#N/A"}},{"$f":"AB40","v":{"$error":"#N/A"}},null,{"$f":"AD40","v":{"$error":"#N/A"}},{"$f":"AE40","v":{"$error":"#N/A"}},{"$f":"AF40","v":{"$error":"#N/A"}},{"$f":"AG40","v":{"$error":"#N/A"}},{"$f":"AH40","v":{"$error":"#N/A"}}]
[null,null,null,{"$f":"IF(Inputs!G31=\"\",0,Inputs!G31)","v":0},{"$f":"E41","v":59},{"$f":"'Final Summary'!K44","v":{"$error":"#N/A"}},{"$f":"'Final Summary'!L44","v":{"$error":"#N/A"}},{"$f":"'Final Summary'!M44","v":{"$error":"#N/A"}},{"$f":"'Final Summary'!N44","v":{"$error":"#N/A"}},{"$f":"'PB Liquefaction Initiation'!Q28","v":{"$error":"#N/A"}},null,{"$f":"'Final Summary'!P44","v":{"$error":"#N/A"}},{"$f":"'Final Summary'!Q44","v":{"$error":"#N/A"}},{"$f":"'Final Summary'!R44","v":{"$error":"#N/A"}},{"$f":"'Final Summary'!S44","v":{"$error":"#N/A"}},{"$f":"'PB Liquefaction Initiation'!N61","v":{"$error":"#N/A"}},null,null,null,null,null,{"$f":"IF(Inputs!$G31=\"\",NA(),Inputs!$G31)","v":{"$error":"#N/A"}},{"$f":"W41","v":{"$error":"#N/A"}},{"$f":"'Final Summary'!V44","v":{"$error":"#N/A"}},{"$f":"'Final Summary'!W44","v":{"$error":"#N/A"}},{"$f":"'Final Summary'!X44","v":{"$error":"#N/A"}},{"$f":"'Final Summary'!Y44","v":{"$error":"#N/A"}},{"$f":"'Det Liquefaction Initiation'!T28","v":{"$error":"#N/A"}},null,{"$f":"'Final Summary'!AA44","v":{"$error":"#N/A"}},{"$f":"'Final Summary'!AB44","v":{"$error":"#N/A"}},{"$f":"'Final Summary'!AC44","v":{"$error":"#N/A"}},{"$f":"'Final Summary'!AD44","v":{"$error":"#N/A"}},{"$f":"'Det Liquefaction Initiation'!O61","v":{"$error":"#N/A"}}]
["Settlement Table",null,null,null,{"$f":"D42+E42","v":59},{"$f":"F42","v":{"$error":"#N/A"}},{"$f":"G42","v":{"$error":"#N/A"}},{"$f":"H42","v":{"$error":"#N/A"}},{"$f":"I42","v":{"$error":"#N/A"}},{"$f":"J42","v":{"$error":"#N/A"}},null,{"$f":"L42","v":{"$error":"#N/A"}},{"$f":"M42","v":{"$error":"#N/A"}},{"$f":"N42","v":{"$error":"#N/A"}},{"$f":"O42","v":{"$error":"#N/A"}},{"$f":"P42","v":{"$error":"#N/A"}},null,null,null,null,null,null,{"$f":"V42+W42","v":{"$error":"#N/A"}},{"$f":"X42","v":{"$error":"#N/A"}},{"$f":"Y42","v":{"$error":"#N/A"}},{"$f":"Z42","v":{"$error":"#N/A"}},{"$f":"AA42","v":{"$error":"#N/A"}},{"$f":"AB42","v":{"$error":"#N/A"}},null,{"$f":"AD42","v":{"$error":"#N/A"}},{"$f":"AE42","v":{"$error":"#N/A"}},{"$f":"AF42","v":{"$error":"#N/A"}},{"$f":"AG42","v":{"$error":"#N/A"}},{"$f":"AH42","v":{"$error":"#N/A"}}]
["Scum. [cm]",null,null,{"$f":"IF(Inputs!G32=\"\",0,Inputs!G32)","v":0},{"$f":"E43","v":59},{"$f":"'Final Summary'!K45","v":{"$error":"#N/A"}},{"$f":"'Final Summary'!L45","v":{"$error":"#N/A"}},{"$f":"'Final Summary'!M45","v":{"$error":"#N/A"}},{"$f":"'Final Summary'!N45","v":{"$error":"#N/A"}},{"$f":"'PB Liquefaction Initiation'!Q29","v":{"$error":"#N/A"}},null,{"$f":"'Final Summary'!P45","v":{"$error":"#N/A"}},{"$f":"'Final Summary'!Q45","v":{"$error":"#N/A"}},{"$f":"'Final Summary'!R45","v":{"$error":"#N/A"}},{"$f":"'Final Summary'!S45","v":{"$error":"#N/A"}},{"$f":"'PB Liquefaction Initiation'!N62","v":{"$error":"#N/A"}},null,null,null,null,null,{"$f":"IF(Inputs!$G32=\"\",NA(),Inputs!$G32)","v":{"$error":"#N/A"}},{"$f":"W43","v":{"$error":"#N/A"}},{"$f":"'Final Summary'!V45","v":{"$error":"#N/A"}},{"$f":"'Final Summary'!W45","v":{"$error":"#N/A"}},{"$f":"'Final Summary'!X45","v":{"$error":"#N/A"}},{"$f":"'Final Summary'!Y45","v":{"$error":"#N/A"}},{"$f":"'Det Liquefaction Initiation'!T29","v":{"$error":"#N/A"}},null,{"$f":"'Final Summary'!AA45","v":{"$error":"#N/A"}},{"$f":"'Final Summary'!AB45","v":{"$error":"#N/A"}},{"$f":"'Final Summary'!AC45","v":{"$error":"#N/A"}},{"$f":"'Final Summary'!AD45","v":{"$error":"#N/A"}},{"$f":"'Det Liquefaction Initiation'!O62","v":{"$error":"#N/A"}}]
["Scum. [in]",null,null,null,{"$f":"D44+E44","v":59},{"$f":"F44","v":{"$error":"#N/A"}},{"$f":"G44","v":{"$error":"#N/A"}},{"$f":"H44","v":{"$error":"#N/A"}},{"$f":"I44","v":{"$error":"#N/A"}},{"$f":"J44","v":{"$error":"#N/A"}},null,{"$f":"L44","v":{"$error":"#N/A"}},{"$f":"M44","v":{"$error":"#N/A"}},{"$f":"N44","v":{"$error":"#N/A"}},{"$f":"O44","v":{"$error":"#N/A"}},{"$f":"P44","v":{"$error":"#N/A"}},null,null,null,null,null,null,{"$f":"V44+W44","v":{"$error":"#N/A"}},{"$f":"X44","v":{"$error":"#N/A"}},{"$f":"Y44","v":{"$error":"#N/A"}},{"$f":"Z44","v":{"$error":"#N/A"}},{"$f":"AA44","v":{"$error":"#N/A"}},{"$f":"AB44","v":{"$error":"#N/A"}},null,{"$f":"AD44","v":{"$error":"#N/A"}},{"$f":"AE44","v":{"$error":"#N/A"}},{"$f":"AF44","v":{"$error":"#N/A"}},{"$f":"AG44","v":{"$error":"#N/A"}},{"$f":"AH44","v":{"$error":"#N/A"}}]
[]
["MSF Options"]
[2012]
[2014]
[]
["Return Period"]
[475]
[1033]
[2475]
[]
["Sampler Type"]
["Standard SS (2-in OD)"]
["Non-Standard (3-in OD)"]
["Non-Standard (2.5-in OD)"]
["D&M SS (3.25-in OD)"]
["Custom Factor"]

{"sheet":"_HiddenCopy","index":13,"n_rows":0,"n_cols":0,"rows_kept":0,"cut":false,"hidden":true,"merged":[[1,2,1,5],[1,7,1,10],[2,7,2,10],[3,7,3,10],[58,5,58,6],[58,9,58,10],[58,1,58,4],[2,2,2,3],[3,2,3,3],[12,22,13,23],[47,1,47,2],[47,5,47,6],[47,9,47,10],[23,10,24,12]]}